program: Gaussian 09
title: 000148346
version: EM64L-G09RevD.01
frameworkgroup: C1[X(C6H14N2O)]
method: RPBEPBE
basis: SDD
operation: Freq
keyword: #p
keyword: freq=noraman
keyword: PBEPBE/SDD
title: #p freq=noraman PBEPBE/SDD
converged: YES YES NO NO
title: Mulliken charges:
elementType: O N N C C C C C C H H H H H H H H H H H H H H
charge: -0.296263 -0.070764 0.033041 0.006895 -0.392708 -0.368206 -0.696607 -0.692035 -0.640198 0.193878 0.201449 0.233613 0.221721 0.208717 0.241561 0.199353 0.218301 0.222464 0.208290 0.224449 0.220943 0.259557 0.262549
chargesum: 0.00000
title: Mulliken charges with hydrogens summed into heavy atoms:
elementType: O N N C C C C C C
charge: -0.296263 -0.070764 0.033041 0.200773 0.042354 0.062231 -0.037391 -0.036833 0.102851
polarizability: 1.00927606e+02 2.27854422e-01 8.00414158e+01 5.34281126e+00 -3.60862792e+00 7.31884532e+01
1716.lowfreq: -19.1026 -13.9012 -0.0009 0.0007 0.0009 3.9912 38.5296 66.9736 75.9655
frequency: 37.2661 66.8056 75.8062 104.9528 127.4896 177.1314 197.5037 236.8687 253.2447 284.7952 310.7697 361.8447 420.0080 459.3698 477.5840 650.5896 758.1974 782.0194 827.5221 865.4631 924.4122 971.6301 1008.8548 1046.2649 1051.5608 1082.1275 1099.3993 1118.6491 1133.8411 1186.6506 1237.7798 1246.2110 1285.0684 1306.5999 1308.0136 1325.0296 1339.8462 1366.2526 1391.1729 1392.6910 1424.7417 1441.2660 1459.9303 1469.0175 1474.6678 1477.6350 1478.2364 1486.3308 1487.5048 2967.0087 2979.4868 2980.6287 2982.7277 2991.0405 3007.5480 3036.1940 3059.1890 3069.1052 3073.3094 3077.3341 3084.6475 3094.3767 3124.8257
redmass: 3.8169 1.9263 1.4394 1.7104 2.0887 1.3796 1.5198 1.5796 3.0007 2.8452 3.1777 5.2003 4.1776 3.0177 2.9315 2.5234 1.4292 1.7740 1.8567 2.0068 1.7792 1.9992 1.2952 3.1028 2.0301 1.7560 1.4074 2.4436 2.5770 2.2861 2.0035 1.6051 1.5625 1.2413 1.5973 2.5913 1.4983 1.4689 1.2082 1.2056 1.1921 1.0455 1.0737 1.0716 1.0466 1.0491 1.0598 1.0535 1.0536 1.0823 1.0378 1.0384 1.0591 1.0341 1.0611 1.1010 1.0982 1.0996 1.0991 1.0992 1.0998 1.1002 1.1014
irintensity: 4.4178 1.0335 0.1201 0.0191 0.0261 2.2346 0.0368 0.1969 4.9575 0.6612 2.7855 0.9098 3.8254 0.9312 2.2485 0.6352 5.4764 16.9423 3.1693 8.2938 11.6450 82.2504 6.9560 4.0738 0.2933 6.6552 0.4651 29.2909 27.8043 31.6920 0.7946 1.1476 57.6871 2.8032 27.4994 32.8223 1.5514 3.3338 12.6219 16.2725 27.1474 16.0569 5.9503 9.8565 14.3947 8.3972 12.0662 11.6347 18.3506 13.5447 39.5850 43.5287 11.6140 18.1213 26.9899 11.2145 5.2889 16.6964 33.9909 64.1283 39.8201 43.9443 11.4422
temp: 298.150 k
press: 1.00000 atm
elementType: 8 7 7 6 6 6 6 6 6 1 1 1 1 1 1 1 1 1 1 1 1 1 1
symmnumber: 1
zpe: 520519.3 jmol-1
zpe.correction: 0.198255 hartree
zpe.thermalcorrener: 0.209971 hartree
zpe.thermalcorrenthalpy: 0.210916 hartree
zpe.thermalcorrgfe: 0.160187 hartree
zpe.sumelectzpe: -420.945910 hartree
zpe.sumelectthermal: -420.934194 hartree
zpe.sumelectthermalent: -420.933250 hartree
zpe.sumelectthermalfe: -420.983978 hartree
dipole: 3.9256 -1.0317 2.6306
dipole: 4.8368
quadrupole: -65.7977 -53.8201 -56.5627
quadrupole: 0.5198 -6.1304 -1.2498
quadrupole: -7.0709 4.9067 2.1642 0.5198 -6.1304 -1.2498
hfenergy: -421.1441654 hartree
pointgroup: C01 [X(C6H14N2O1)]
dipole: 1.6163212 -0.22828 0.9780474 debye
dipolederiv: -1.0405055 0.0067765 -0.4251097 -0.44564 -0.2868619 -0.1802726 -0.0113298 0.0704884 -0.277661 -0.6901428 -0.0059628 -0.1496584 0.1870966 -0.2352999 0.0401079 -0.5092995 -0.0710299 -0.4068623 1.066136 -0.0177583 0.6613703 0.0601485 -0.0643787 0.0246754 0.6464493 -0.0218872 0.2604203 0.5339502 0.1366487 -0.0289611 0.1840917 0.2510456 0.0874611 0.019388 0.0520829 0.2235537 0.0464555 0.0194864 0.0494258 0.0234466 0.0375351 0.0181801 0.0364246 0.0044166 0.0595094 0.009591 -0.0436879 -0.0127467 -0.0390476 0.0243586 -0.0732375 -0.0122374 -0.0419587 0.0979926 0.0123802 0.0305289 0.0317522 0.0395342 -0.0306354 -0.03683 0.0478665 -0.0193523 0.0706228 -0.088891 -0.011834 0.0025765 0.047949 0.0589386 -0.0169442 0.0648639 -0.0189254 0.0841934 0.1092541 -0.0464834 -0.0182307 0.0278277 0.1668524 0.0469379 -0.0583295 0.0177388 0.1545837 -0.0214881 -0.0254863 -0.0354351 -0.0176084 0.0362973 0.0068144 -0.0463556 0.0086818 -0.1591137 -0.1734832 -0.0601828 0.0240355 -0.080957 0.0388727 0.0023264 0.0011814 -0.0124101 0.0780932 0.0969148 0.0490227 -0.0449102 0.0136958 0.0534531 -0.0439715 -0.0227841 -0.0113122 -0.1085239 -0.0025316 0.0145878 -0.071125 0.0103912 0.0830679 0.0347442 -0.0367233 -0.0150461 -0.1195433 0.026297 -0.0408525 0.0275756 -0.0512838 -0.1771553 0.0376242 0.0155265 0.0727661 0.0505715 -0.1327066 -0.0203946 0.0167852 -0.0557839 0.1181108 -0.0030323 -0.0079138 -0.0016303 0.0775898 0.0546316 0.0101986 -0.0776982 0.0294843 0.0773642 0.0365375 -0.0482111 -0.0323531 -0.1669959 0.0868151 -0.0285372 0.0199004 -0.0108141 -0.1910904 0.0479179 0.0200735 0.0787986 0.0631811 0.0685363 -0.0491576 -0.0059782 -0.1003406 -0.115561 0.0820359 0.0043714 0.0842433 0.058706 0.0635091 -0.0126885 -0.0183941 -0.0250569 0.091964 -0.0026864 -0.095467 0.0024736 -0.1645213 -0.0650111 0.09087 0.0595476 0.1312849 -0.0281519 -0.0829833 0.0738156 -0.0821845 0.0508087 -0.0192872 0.0368645 -0.1224119 0.0064395 0.0999758 0.013126 -0.096912 0.0269591 0.0351323 0.0857512 -0.0449785 -0.0038567 -0.0021973 -0.063426 -0.0096453 -0.0253581 -0.1000347 0.0127598 -0.0261749 0.01302 0.121547 0.0673397 0.0547244 -0.0288862 0.0409605 0.0094753 0.025503 unknown
polarizability: 100.8573262|2.6831641|80.6061384|4.955262|-2.7678658|72.6940108 unknown
InChI: InChI=1S/C6H14N2O/c1-4-6(5-2)8(3)7-9/h6H,4-5H2,1-3H3
charge 0 multiplicity 1
23 atoms
O  -2.68911 -0.708936 -0.762308
N  -0.699075 -0.535061 0.23954
N  -1.546363 -0.10025 -0.751234
C  0.685221 0.026911 0.26103
C  0.724391 1.487084 -0.251557
C  1.642142 -0.92138 -0.519671
C  -0.115474 2.470549 0.589639
C  3.138927 -0.612804 -0.29967
C  -1.109471 -1.625454 1.146975
H  0.990682 0.029888 1.32883
H  1.783357 1.806712 -0.237223
H  0.387742 1.511154 -1.303159
H  1.389185 -0.862011 -1.596111
H  1.439967 -1.964188 -0.204027
H  -1.19028 2.228668 0.529207
H  0.185435 2.449955 1.654671
H  0.016654 3.504635 0.223422
H  3.423689 0.372442 -0.708891
H  3.39415 -0.619496 0.777385
H  3.768661 -1.372067 -0.797203
H  -0.287489 -1.832152 1.848893
H  -1.359552 -2.536976 0.573983
H  -2.018389 -1.332724 1.702377
