program: Gaussian 09
title: 000148343
version: EM64L-G09RevD.01
frameworkgroup: C1[X(C9H13N5O2)]
method: RPBEPBE
basis: SDD
operation: Freq
keyword: #p
keyword: freq=noraman
keyword: PBEPBE/SDD
title: #p freq=noraman PBEPBE/SDD
converged: YES YES NO NO
title: Mulliken charges:
elementType: O O N N N N N C C C C C C C C C H H H H H H H H H H H H H
charge: -0.446233 -0.447869 -0.186570 -0.078105 -0.175753 -0.060323 -0.606379 -0.053381 -0.449743 -0.342799 0.229446 -0.354913 -0.243326 -0.109113 0.159535 -0.337915 0.242402 0.241524 0.233550 0.187347 0.208706 0.219297 0.205063 0.292255 0.386920 0.252135 0.349945 0.347656 0.336640
chargesum: 0.00000
title: Mulliken charges with hydrogens summed into heavy atoms:
elementType: O O N N N N N C C C C C C C C C
charge: -0.059313 -0.097923 -0.186570 -0.078105 -0.175753 -0.060323 0.077917 0.189022 0.025330 0.053254 0.229446 0.069447 0.048929 -0.109113 0.159535 -0.085780
polarizability: 1.90548729e+02 -4.70866234e+00 1.46186528e+02 -6.91703498e+00 -9.56413883e+00 8.12069627e+01
1716.lowfreq: 0.0005 0.0009 0.0010 5.3426 7.3655 11.5919 33.3650 42.4139 71.9384
frequency: 33.3251 42.3349 71.9349 115.1751 155.2031 161.3857 181.1539 190.6157 231.7213 260.9579 278.2272 292.5644 302.1485 327.5682 348.5495 431.4377 511.0538 521.3154 531.0849 552.3742 554.2704 571.7120 602.9399 644.9099 665.4180 679.6410 714.7254 790.7504 812.7486 827.2974 847.8201 868.0020 930.1632 936.2390 959.0084 969.3107 983.9444 1000.9798 1029.4011 1042.6831 1074.6981 1101.2925 1148.4179 1168.9110 1194.5321 1210.1680 1217.1357 1230.1576 1264.4065 1271.7050 1287.0633 1299.3458 1325.8084 1334.2707 1358.9809 1365.5178 1372.7593 1380.4736 1419.0821 1429.5703 1460.4760 1470.6168 1478.8673 1493.7367 1508.6405 1541.9974 1581.3088 1635.7912 2928.8410 2946.3148 2984.8180 2990.2082 2992.4117 3016.2548 3061.8982 3078.2053 3172.3633 3252.2059 3537.5530 3571.6006 3692.1384
redmass: 5.8230 6.0101 5.5762 2.9667 2.6512 4.1962 4.9005 4.4184 4.7138 3.9756 2.3117 1.5207 3.9857 4.9655 3.6339 3.7360 4.0015 8.7929 1.2539 1.9187 1.4217 3.8060 3.3772 4.8023 8.2941 4.8369 6.3320 5.0179 1.2503 1.5214 1.1397 7.1662 1.4484 3.0720 2.6914 3.1976 3.4684 2.9748 3.2059 3.8596 1.8175 3.5000 2.6042 1.5173 1.4235 2.0090 1.1819 1.7009 1.4615 1.4552 1.6328 4.5217 3.4758 1.3335 1.2418 1.5517 2.3782 4.2928 1.4161 2.9634 1.1513 2.9996 1.0858 1.0830 1.1632 8.5094 1.8089 2.8743 1.0683 1.0552 1.0804 1.0802 1.1030 1.0625 1.0930 1.1004 1.0926 1.0981 1.0444 1.0666 1.1056
irintensity: 1.2042 2.2339 1.1665 7.9306 5.8231 10.2083 3.1249 5.5503 3.7119 6.9325 43.5196 93.5441 23.0906 5.9814 4.2580 11.0034 16.3027 6.5485 254.1340 1.5851 6.8932 8.0361 6.3609 40.3747 14.2672 2.8098 18.1988 5.8057 14.5954 11.4757 123.1515 9.7006 9.2915 14.4435 6.4314 74.5682 0.8457 16.0090 94.2690 2.5724 1.7562 7.2515 4.9975 52.7259 44.3016 7.0319 25.6457 20.7361 20.9869 41.0656 28.5758 66.0103 30.6108 2.5137 26.0040 5.4179 49.9798 7.5598 4.5877 45.4869 0.6405 7.4844 23.1230 7.6768 125.2516 53.2825 27.2463 622.6862 130.1714 50.3107 242.9538 361.6500 234.8467 21.3076 4.8172 45.0058 11.3369 0.1756 134.0821 4.7105 52.5758
temp: 298.150 k
press: 1.00000 atm
elementType: 8 8 7 7 7 7 7 6 6 6 6 6 6 6 6 6 1 1 1 1 1 1 1 1 1 1 1 1 1
symmnumber: 1
zpe: 603053.3 jmol-1
zpe.correction: 0.229691 hartree
zpe.thermalcorrener: 0.244284 hartree
zpe.thermalcorrenthalpy: 0.245228 hartree
zpe.thermalcorrgfe: 0.187516 hartree
zpe.sumelectzpe: -773.759137 hartree
zpe.sumelectthermal: -773.744544 hartree
zpe.sumelectthermalent: -773.743600 hartree
zpe.sumelectthermalfe: -773.801312 hartree
dipole: -0.4426 -4.1004 -1.2131
dipole: 4.2989
quadrupole: -82.4940 -103.8446 -93.0741
quadrupole: -2.9714 8.5095 3.7094
quadrupole: 10.6436 -10.7070 0.0634 -2.9714 8.5095 3.7094
hfenergy: -773.9888279 hartree
pointgroup: C01 [X(C9H13N5O2)]
dipole: 0.1544269 -1.5442844 0.6722497 debye
polarizability: 190.6496006|7.6169916|109.8008682|2.7361031|-33.6009457|117.4917512 unknown
InChI: InChI=1S/C9H13N5O2/c10-8-7-9(12-4-11-8)14(5-13-7)6(3-16)1-2-15/h4-6,15-16H,1-3,10H2
charge 0 multiplicity 1
29 atoms
O  -1.345186 2.28698 -1.907415
O  -4.260918 -2.301057 0.961338
N  -0.569881 -0.066869 0.166705
N  0.958102 -0.99133 1.628107
N  1.028541 1.133575 -1.328274
N  3.36484 0.801097 -0.665985
N  3.988927 -0.496903 1.205703
C  -1.869957 0.276825 -0.502499
C  -3.065207 -0.344006 0.253199
C  -2.000463 1.821246 -0.700713
C  0.698989 0.327552 -0.27172
C  -3.232577 -1.852101 0.010176
C  -0.344966 -0.851261 1.315189
C  1.62416 -0.254932 0.634133
C  3.006386 0.008376 0.401881
C  2.377621 1.313756 -1.455304
H  -1.823958 -0.148361 -1.526914
H  -3.987972 0.158556 -0.085913
H  -2.994644 -0.156011 1.34092
H  -1.633112 2.338704 0.214297
H  -3.068789 2.066167 -0.831157
H  -2.279201 -2.397359 0.175127
H  -3.55168 -2.028152 -1.039277
H  -1.155415 -1.286818 1.892288
H  -0.368466 1.989992 -1.87629
H  2.705229 1.949493 -2.282364
H  -4.46205 -3.258548 0.810025
H  3.742026 -1.080507 2.002475
H  4.96052 -0.273701 0.998964
