program: Gaussian 09
title: 000148311
version: EM64L-G09RevD.01
frameworkgroup: C1[X(C13H7N)]
method: RPBEPBE
basis: SDD
operation: Freq
keyword: #pfreq=noraman
keyword: PBEPBE/SDD
title: #p freq=noraman PBEPBE/SDD
converged: YES YES YES YES
title: Mulliken charges:
elementType: N C C C C C C C C C C C C C H H H H H H H
charge: -0.034412 -0.271393 0.226075 0.411674 0.508449 0.310665 -0.583951 -0.370220 -0.423722 -0.423263 -0.415653 -0.206185 -0.213078 -0.255648 0.275832 0.261449 0.255221 0.244444 0.244563 0.229877 0.229276
chargesum: 0.00000
title: Mulliken charges with hydrogens summed into heavy atoms:
elementType: N C C C C C C C C C C C C C
charge: -0.034412 -0.271393 0.226075 0.411674 0.508449 0.310665 -0.308119 -0.108772 -0.168501 -0.178819 -0.171090 0.023693 0.016199 -0.255648
polarizability: 2.23715470e+02 -1.08870987e+01 1.73254619e+02 2.46949483e-03 9.08801360e-04 5.37565731e+01
1716.lowfreq: -10.6184 -0.0009 -0.0004 0.0005 3.0287 3.9620 93.8086 116.9151 170.4725
frequency: 93.8076 116.9151 170.4720 212.8509 255.3208 367.3154 377.3137 407.8789 456.3462 464.3134 511.0503 522.9107 559.2381 593.5707 611.5974 638.7419 680.9078 687.3654 770.4559 774.2223 783.3273 799.1775 847.6281 878.2029 929.4102 939.0125 953.3948 986.2735 993.7098 1023.6708 1043.5039 1073.5532 1144.1149 1170.4293 1193.8296 1206.4335 1235.5268 1274.2684 1295.8034 1367.3779 1407.3245 1414.8140 1464.2517 1469.7253 1487.0131 1502.8035 1597.8235 1625.1720 1630.1849 2166.4468 3129.7758 3131.5685 3141.5739 3144.2178 3161.8360 3163.1937 3202.1582
redmass: 7.3491 8.9836 4.0112 3.7914 5.3236 4.2274 6.1424 7.0754 3.1746 6.2713 6.4378 6.7870 7.1447 3.1536 6.0629 3.7339 6.5344 2.8380 4.8685 1.3034 1.8094 5.2525 2.3539 1.6788 1.4238 1.4658 6.5771 1.3760 1.3885 2.7848 1.9051 2.8991 1.7675 1.2450 1.3992 1.4852 1.7219 2.5270 3.5109 3.0967 3.6509 1.8522 6.6945 3.9782 3.8639 6.4681 6.8257 7.9112 7.7905 12.6110 1.0866 1.0867 1.0924 1.0926 1.0984 1.0982 1.0970
irintensity: 0.3201 3.2753 7.2219 0.8681 8.7195 0.0208 1.1997 0.8618 0.2502 2.2224 0.0039 1.6485 3.6380 0.2115 2.0282 2.6483 0.8911 4.2842 2.2224 4.2462 76.4739 0.0894 19.2087 60.8011 1.4822 0.7834 1.9492 0.2637 2.5748 1.9641 9.0556 9.7316 1.8319 7.5615 2.8368 9.9713 13.9872 2.7742 19.9088 1.4827 1.3109 4.9682 89.8095 6.7804 17.8359 13.6834 7.6575 2.2902 4.7713 61.6706 0.2657 0.8133 10.7670 9.8086 40.8289 17.4107 2.0803
temp: 298.150 k
press: 1.00000 atm
elementType: 7 6 6 6 6 6 6 6 6 6 6 6 6 6 1 1 1 1 1 1 1
symmnumber: 1
zpe: 408232.4 jmol-1
zpe.correction: 0.155488 hartree
zpe.thermalcorrener: 0.165120 hartree
zpe.thermalcorrenthalpy: 0.166065 hartree
zpe.thermalcorrgfe: 0.120332 hartree
zpe.sumelectzpe: -553.413426 hartree
zpe.sumelectthermal: -553.403793 hartree
zpe.sumelectthermalent: -553.402849 hartree
zpe.sumelectthermalfe: -553.448582 hartree
dipole: 5.6984 0.2233 -0.0002
dipole: 5.7028
quadrupole: -93.1548 -63.8910 -84.7181
quadrupole: -1.9692 0.0024 0.0002
quadrupole: -12.5669 16.6970 -4.1301 -1.9692 0.0024 0.0002
hfenergy: -553.5689139 hartree
pointgroup: C01 [X(C13H7N1)]
dipole: -2.2435322 0.023043 0.0000722 debye
dipolederiv: -0.6022582 0.0221974 -0.0001774 -0.0586291 -0.217818 -0.0000197 -0.0000159 -0.0000237 -0.2540886 -0.3957836 0.2410375 -0.0000111 0.2241673 -0.0404909 0.000009 -0.0000216 0.0000168 -0.0686044 -0.0938988 -0.1948494 0. 0.2034089 -0.1677081 0.0000106 -0.00006 -0.0000148 0.0037281 -0.3640691 0.2290199 -0.000017 -0.1912515 -0.110311 -0.0000015 -0.0000327 0.0000176 0.0327085 -0.0029593 -0.1324114 -0.000005 -0.1224231 -0.1559035 -0.000001 0.0000111 -0.0000108 0.0840738 -0.2109304 -0.0938562 0.0000074 -0.6210259 0.3187015 -0.0000159 -0.0000138 -0.0000094 0.0804015 0.5440625 -0.1813714 0.0000373 0.2240772 -0.0746794 0.0000069 -0.0000353 -0.0000254 -0.1674272 0.2665379 0.0990332 0.0000197 -0.205289 0.0423337 -0.0000098 0.0000131 0.0000071 -0.1051418 0.2777438 -0.2842894 0.000022 0.0518304 0.2017567 -0.0000007 0.0000581 -0.000013 -0.1320007 0.2154823 -0.0385396 0.000023 0.1251137 0.1719721 -0.0000005 0.0000147 -0.0000094 -0.1623852 0.0531901 0.1129231 0.0000155 -0.1591728 0.2757766 -0.0000113 0.0000175 0.000005 -0.1554131 -0.356477 -0.0863128 -0.0000097 -0.0146338 0.1783351 -0.0000075 -0.0000085 -0.0000097 -0.1521496 0.0179557 0.2521872 0.0000126 0.3176263 -0.3016806 0.000016 0.0000077 0.0000122 -0.1552182 0.6308964 0.0334225 0.0001455 0.1565665 -0.0730517 0.0000143 0.0001345 0.0000382 0.0325505 0.0491164 0.0415587 -0.0000068 0.0742246 0.0022022 0.0000003 -0.0000066 0.0000121 0.1776462 -0.0236771 -0.0746606 -0.0000094 -0.0501673 0.0679977 0.0000009 -0.000007 -0.0000051 0.1521887 0.0949306 0.0146257 -0.0000041 -0.0070385 -0.0910818 0.0000001 -0.0000068 -0.0000027 0.1561574 -0.0434562 0.1092734 -0.0000127 0.0573067 0.0289863 0.0000049 -0.0000117 0.0000092 0.1572712 -0.061971 0.0413952 -0.0000133 0.0961536 0.0512433 0.0000066 -0.0000172 0.0000046 0.1564541 0.0848775 -0.0097611 -0.0000029 0.002967 -0.1297744 0.0000039 -0.0000019 0.0000045 0.1589198 -0.0793125 -0.1006221 -0.0000136 -0.1038111 0.023194 -0.0000056 -0.0000175 -0.0000035 0.160329 unknown
polarizability: 223.0446591|12.3259323|173.9254294|0.0024947|-0.0008371|53.7565731 unknown
InChI: InChI=1S/C13H7N/c14-8-11-7-10-5-1-3-9-4-2-6-12(11)13(9)10/h1-7H
charge 0 multiplicity 1
21 atoms
N  4.36852 -0.193069 -0.000233
C  -0.501452 -0.021435 -0.000029
C  0.78424 0.594021 0.00003
C  -0.374879 -1.446899 -0.00002
C  -1.726199 0.681204 -0.000119
C  1.766993 -0.524327 0.000106
C  1.066666 -1.737732 0.000034
C  0.858473 1.991445 -0.000001
C  -1.550054 -2.213785 -0.00009
C  -1.633543 2.11793 -0.000141
C  -2.917066 -0.127071 -0.000187
C  -0.372017 2.738569 -0.000082
C  -2.814769 -1.530789 -0.000175
C  3.182115 -0.361407 0.000205
H  1.523644 -2.728507 0.000052
H  1.817758 2.520688 0.000037
H  -1.52709 -3.309175 -0.000096
H  -2.544256 2.728161 -0.000205
H  -3.90473 0.348865 -0.000255
H  -0.316695 3.832718 -0.000099
H  -3.731858 -2.130203 -0.000234
