program: Gaussian 09
title: 000148310
version: EM64L-G09RevD.01
frameworkgroup: C1[X(C12H17Cl2N)]
method: RPBEPBE
basis: SDD
operation: Freq
keyword: #p
keyword: freq=noraman
keyword: PBEPBE/SDD
title: #p freq=noraman PBEPBE/SDD
converged: YES YES NO NO
title: Mulliken charges:
elementType: Cl Cl N C C C C C C C C C C C C H H H H H H H H H H H H H H H H H
charge: -0.073166 -0.054121 -0.221179 0.319821 -0.322695 -0.372919 0.302473 -0.510101 0.465771 -0.365688 -0.604365 -0.575046 -0.437093 -0.827020 -0.817278 0.228715 0.229052 0.218584 0.262977 0.235984 0.225198 0.296139 0.266770 0.263683 0.263349 0.230023 0.237067 0.229775 0.222868 0.223676 0.237528 0.221219
chargesum: 0.00000
title: Mulliken charges with hydrogens summed into heavy atoms:
elementType: Cl Cl N C C C C C C C C C C C C
charge: -0.073166 -0.054121 -0.221179 0.319821 0.135072 0.108641 0.302473 -0.274117 0.465771 -0.140490 -0.041456 -0.048014 -0.207070 -0.137309 -0.134855
polarizability: 1.73244845e+02 -1.97576982e+01 1.40857216e+02 5.44926103e+00 2.11844004e+01 1.48683054e+02
1716.lowfreq: -13.1622 -0.0021 -0.0017 -0.0008 5.3518 5.7926 31.2619 33.6745 39.5487
frequency: 31.0163 33.4718 39.4385 48.1671 51.7728 92.4472 110.0144 123.7761 162.8365 197.7672 207.5620 216.6253 250.4916 280.8056 306.0165 321.1839 357.7395 373.9819 439.7704 445.0446 479.2363 495.7032 560.6802 600.6195 611.9909 677.6907 702.8309 725.0940 739.6575 787.4578 814.0012 841.5841 880.8992 902.9437 927.0076 948.0149 967.4146 995.5386 1006.2497 1016.2352 1041.6357 1045.9549 1057.3503 1062.0665 1117.9506 1132.6494 1160.1082 1195.1788 1209.4930 1225.0755 1242.4119 1253.4218 1284.7022 1285.7852 1296.2839 1328.2598 1362.4523 1368.2081 1375.2621 1391.1323 1397.5946 1417.9935 1438.9946 1445.0805 1458.3265 1469.6155 1472.4479 1473.6086 1486.0273 1496.2620 1503.4591 1579.8959 1619.2474 2929.0119 2948.5810 2962.4233 2974.3901 3041.1511 3042.7362 3045.0470 3055.0149 3068.7516 3081.2955 3082.6549 3098.5473 3112.1771 3126.6828 3128.3060 3140.4426 3155.2441
redmass: 8.5147 4.5709 1.0384 8.4172 6.4927 2.5044 5.2024 2.9201 3.3639 3.3442 1.0397 3.9896 3.1677 2.6346 3.8696 3.4212 2.6346 3.1471 3.0056 3.7436 3.6560 3.1034 3.7664 3.5580 4.9970 5.6473 5.4416 3.1967 3.8864 1.1530 1.2770 2.6672 1.4337 2.3083 2.2625 1.3381 1.7703 1.7623 1.3605 1.6868 1.5243 1.5900 2.4820 2.6407 1.6884 1.6156 1.3532 1.8067 1.6715 2.5150 1.7373 1.2143 1.2735 1.4121 1.3934 1.3642 1.7020 2.7389 1.5994 1.2545 1.2237 2.6959 1.0939 1.0942 1.0915 1.0876 1.0750 1.0604 1.1006 1.1052 2.9119 5.6504 6.4809 1.0706 1.0680 1.0409 1.0382 1.0913 1.0916 1.0595 1.0956 1.0563 1.0994 1.0996 1.0914 1.0872 1.1079 1.0906 1.0965 1.1119
irintensity: 1.1916 0.5292 0.5178 0.4270 1.1142 3.0538 1.5039 1.1024 3.6437 0.8036 0.2905 4.4713 4.1465 0.1304 1.8439 0.0962 1.4915 4.1011 9.7315 10.6362 4.0889 5.7948 15.3617 1.9704 14.3575 51.8034 18.9917 0.4288 1.4930 5.8388 33.9625 4.3548 9.1709 7.8003 12.3461 0.4904 8.8012 22.7483 0.8473 5.7160 6.2287 18.4786 2.8206 1.9921 39.5169 51.4895 3.1025 4.3456 5.1453 33.2711 20.0099 18.9726 0.3818 6.3694 23.3131 26.7108 7.7756 1.7188 1.6418 16.4370 9.2704 31.4478 15.6341 12.5254 6.3213 6.3948 24.3017 7.2936 19.2372 15.6124 62.5408 29.9210 41.0914 58.8616 40.7544 48.0479 35.4411 10.1725 25.9790 44.2305 21.7125 13.9114 16.7959 22.1998 1.8636 14.4929 17.6343 24.3087 21.8734 9.5828
temp: 298.150 k
press: 1.00000 atm
elementType: 17 17 7 6 6 6 6 6 6 6 6 6 6 6 6 1 1 1 1 1 1 1 1 1 1 1 1 1 1 1 1 1
symmnumber: 1
zpe: 690587.2 jmol-1
zpe.correction: 0.263031 hartree
zpe.thermalcorrener: 0.279913 hartree
zpe.thermalcorrenthalpy: 0.280858 hartree
zpe.thermalcorrgfe: 0.215765 hartree
zpe.sumelectzpe: -1441.191525 hartree
zpe.sumelectthermal: -1441.174643 hartree
zpe.sumelectthermalent: -1441.173698 hartree
zpe.sumelectthermalfe: -1441.238791 hartree
dipole: 0.2988 1.6086 2.0204
dipole: 2.5998
quadrupole: -112.0775 -102.1494 -101.8853
quadrupole: -12.4319 0.6215 7.3437
quadrupole: -6.7067 3.2213 3.4854 -12.4319 0.6215 7.3437
hfenergy: -1441.454556 hartree
pointgroup: C01 [X(C12H17Cl2N1)]
dipole: 0.3272689 0.2836992 -0.9266217 debye
polarizability: 182.882371|-4.8274654|119.9767892|-1.3651612|-10.7662252|159.925955 unknown
InChI: InChI=1S/C12H17Cl2N/c1-10-3-4-11(2)12(9-10)15(7-5-13)8-6-14/h3-4,9H,5-8H2,1-2H3
charge 0 multiplicity 1
32 atoms
Cl 2.709375 -3.080638 1.848245
Cl 0.993247 3.204125 0.812578
N  1.208667 0.062653 -0.395998
C  -0.231287 0.018447 -0.36539
C  1.979331 -0.667635 0.628586
C  1.895123 1.211175 -1.012157
C  -0.978941 0.029987 -1.587264
C  -0.919766 -0.104494 0.87163
C  -2.329293 -0.184556 0.944482
C  -2.391116 -0.032319 -1.499907
C  1.727386 -2.177641 0.506427
C  2.408248 2.297154 -0.04901
C  -3.065351 -0.137226 -0.265089
C  -0.311601 0.0362 -2.952241
C  -3.032395 -0.273017 2.288869
H  3.054026 -0.480325 0.448341
H  1.770038 -0.336178 1.668115
H  2.790187 0.854607 -1.571238
H  1.221024 1.679648 -1.74487
H  -0.347338 -0.112043 1.80651
H  -2.971816 -0.032008 -2.431031
H  0.675744 -2.446932 0.676345
H  2.082525 -2.577165 -0.454063
H  3.031299 1.892999 0.763496
H  2.963815 3.073161 -0.600238
H  -4.159741 -0.198182 -0.241096
H  0.66284 -0.483582 -2.916355
H  -0.950656 -0.472376 -3.694975
H  -0.128272 1.06007 -3.335552
H  -2.456587 -0.87861 3.011532
H  -3.163088 0.732055 2.735108
H  -4.036329 -0.721955 2.190112
