program: Gaussian 09
title: 000148260
version: EM64L-G09RevD.01
frameworkgroup: C1[X(C4H8ClO4P)]
method: RPBEPBE
basis: SDD
operation: Freq
keyword: #p
keyword: freq=noraman
keyword: PBEPBE/SDD
title: #p freq=noraman PBEPBE/SDD
converged: YES YES NO NO
title: Mulliken charges:
elementType: Cl P O O O O C C C C H H H H H H H H
charge: -0.038531 1.407002 -0.494342 -0.519386 -0.463846 -0.557953 -0.479603 -0.476843 0.158923 -0.508172 0.249448 0.246073 0.246136 0.249027 0.247729 0.243772 0.255593 0.234973
chargesum: 0.00000
title: Mulliken charges with hydrogens summed into heavy atoms:
elementType: Cl P O O O O C C C C
charge: -0.038531 1.407002 -0.494342 -0.519386 -0.463846 -0.557953 0.262055 0.263685 0.158923 -0.017606
polarizability: 9.99633475e+01 2.26061800e-01 1.01968281e+02 -5.99353621e+00 1.23238312e+01 7.20794753e+01
1716.lowfreq: -15.7111 -11.5900 -0.0027 -0.0027 -0.0024 2.3841 30.9293 40.9996 53.0668
frequency: 30.8655 40.7009 53.0217 72.3162 83.6749 107.0834 133.2222 144.5775 183.8368 218.2403 262.5141 276.3692 341.6575 362.5919 414.4407 437.5254 488.8756 527.4508 591.7107 652.3593 675.0802 701.6524 878.0708 947.0531 956.6314 968.2162 1080.6328 1111.7092 1112.1578 1117.6527 1128.3068 1131.9672 1387.7989 1422.2537 1429.1264 1454.3463 1459.0443 1471.1977 1471.7830 1646.3796 2999.1867 3000.6289 3108.8875 3109.6301 3136.6596 3140.6135 3141.5234 3257.2619
redmass: 5.0128 1.2170 4.6780 3.1538 3.6666 2.8058 1.3549 3.3648 5.1390 8.6151 5.5365 7.2859 5.0103 5.6461 5.7843 10.5318 8.9513 5.7813 7.3819 5.2552 1.1118 10.4311 1.3260 4.3144 5.2181 9.9023 11.9154 2.3169 1.3864 1.2296 1.2785 1.3055 1.1479 1.1226 1.1189 1.0508 1.0512 1.0534 1.0540 6.8730 1.0285 1.0286 1.1063 1.1064 1.0621 1.1045 1.1050 1.1162
irintensity: 0.4734 1.3129 2.3588 4.1144 4.8803 1.3080 1.1200 4.9776 2.6249 4.5856 11.4040 11.6027 27.3855 23.6658 8.9624 10.3505 101.7440 8.5399 94.6585 102.6697 2.6818 129.8633 98.8194 182.6181 189.8978 127.5921 151.1504 243.8819 58.0843 3.8342 0.7954 2.4519 3.6276 3.3914 2.9692 7.7107 13.5285 21.0331 9.8927 169.0586 36.2820 33.9120 16.3684 22.2071 4.3375 10.7807 8.3609 0.8940
temp: 298.150 k
press: 1.00000 atm
elementType: 17 15 8 8 8 8 6 6 6 6 1 1 1 1 1 1 1 1
symmnumber: 1
zpe: 322205.1 jmol-1
zpe.correction: 0.122721 hartree
zpe.thermalcorrener: 0.136390 hartree
zpe.thermalcorrenthalpy: 0.137334 hartree
zpe.thermalcorrgfe: 0.080278 hartree
zpe.sumelectzpe: -1258.534979 hartree
zpe.sumelectthermal: -1258.521311 hartree
zpe.sumelectthermalent: -1258.520367 hartree
zpe.sumelectthermalfe: -1258.577423 hartree
dipole: 0.4678 1.6108 4.7384
dipole: 5.0265
quadrupole: -70.8312 -64.4856 -78.3224
quadrupole: 2.9936 2.7411 -3.4723
quadrupole: 0.3819 6.7275 -7.1093 2.9936 2.7411 -3.4723
hfenergy: -1258.6577008 hartree
pointgroup: C01 [X(C4H8Cl1O4P1)]
dipole: 0.0296734 -0.4900711 1.9156562 debye
dipolederiv: -0.2455724 -0.1167039 -0.011191 -0.271451 -0.6787862 0.1675735 -0.0004821 0.1724631 -0.1471392 2.5385697 0.3239161 0.0211301 -0.196785 2.0198487 -0.1130224 -0.0033138 0.3672267 1.7401801 -0.6514641 -0.1242352 0.0469776 -0.2240138 -1.1769833 0.260064 0.1113941 0.339691 -0.643559 -0.6588999 0.1100086 0.0404588 0.2681001 -1.1248656 -0.2548316 0.2186986 -0.4860035 -0.7727039 -1.7878601 -0.3124945 -0.3236199 -0.3677152 -0.693722 -0.0200666 -0.6143979 0.0256106 -0.6313482 -0.6679258 -0.0110566 -0.0471037 0.0390987 -0.5919756 0.0278765 -0.0435562 -0.0463728 -0.6445319 0.2046679 -0.1203382 -0.0005213 0.0757286 0.5236197 -0.1266546 -0.186715 -0.3923653 0.374297 0.2571203 -0.1034879 -0.0433962 -0.1923222 0.7227353 0.2895664 0.0316245 0.0349345 0.2103563 1.1861786 0.2609243 0.4436471 0.8936035 1.1899611 -0.2389829 0.6269925 -0.2912392 0.4730321 -0.4972625 0.1427289 -0.0198598 0.1049738 -0.2911279 0.0621143 -0.0782482 0.0211134 -0.4085997 0.0372514 -0.1033294 -0.0316358 -0.1113298 -0.0544669 0.0077893 -0.017279 0.0264871 0.0846594 0.0962531 0.0428903 0.0315647 0.0341822 0.0315606 -0.0719686 0.0665184 0.022745 -0.0942308 -0.0694461 0.1302661 -0.0153997 0.0512322 0.0524055 0.0360427 0.028417 0.0642158 0.0574125 -0.0383529 0.0694177 -0.0591118 0.0470198 0.0075883 -0.0332533 -0.1143376 0.0533727 0.0587006 -0.0141057 -0.1031867 0.0252496 -0.047777 -0.0328953 -0.0274314 0.0250231 0.056237 0.0959742 0.1070299 0.0244858 0.0412143 0.0392774 0.0252509 -0.0372349 0.0523201 -0.0522773 -0.0803023 0.0723914 -0.0762285 -0.0568646 -0.0749434 0.0856572 0.0124647 -0.096542 0.0177975 0.1667581 0.1314273 -0.033577 -0.0415384 -0.066879 -0.0138043 0.0599549 -0.0061165 0.0663636 0.1610447 unknown
polarizability: 99.0196791|0.7659495|100.1626449|12.2781937|-10.5326335|74.82878 unknown
InChI: InChI=1S/C4H8ClO4P/c1-4(5)9-10(6,7-2)8-3/h1H2,2-3H3
charge 0 multiplicity 1
18 atoms
Cl 1.89773 1.625812 -0.576546
P  -1.091215 -0.065898 -0.683462
O  -1.950909 -1.533542 -0.671483
O  -1.280088 0.572696 0.909087
O  0.564455 -0.759009 -0.603239
O  -1.434428 0.877913 -1.897647
C  -1.754168 -2.527418 0.41568
C  -1.546849 2.02902 1.06803
C  1.645666 -0.121299 -0.030214
C  2.527132 -0.714827 0.799863
H  -2.45943 -3.333856 0.168803
H  -1.999976 -2.08162 1.394664
H  -0.717237 -2.902948 0.404947
H  -2.42073 2.334533 0.468324
H  -0.658879 2.612492 0.772468
H  -1.750673 2.14669 2.14213
H  3.426387 -0.196307 1.133966
H  2.352212 -1.742931 1.128829
