program: Gaussian 09
title: 000148269
version: EM64L-G09RevD.01
frameworkgroup: C1[X(C17H23ClO2)]
method: RPBEPBE
basis: SDD
operation: Freq
keyword: #p
keyword: freq=noraman
keyword: PBEPBE/SDD
title: #p freq=noraman PBEPBE/SDD
converged: YES YES NO NO
title: Mulliken charges:
elementType: Cl O O C C C C C C C C C C C C C C C C C H H H H H H H H H H H H H H H H H H H H H H H
charge: -0.068776 -0.321046 -0.267141 0.396619 -0.119333 -0.462519 -0.444425 -0.772757 -0.534083 -0.713305 0.446773 -0.828598 -0.345396 -0.385713 0.363779 -0.329817 -0.349493 -0.207951 -0.188286 -0.115609 0.223099 0.217965 0.217430 0.223943 0.202921 0.214710 0.228129 0.228515 0.227153 0.206688 0.213197 0.206064 0.264536 0.225660 0.241401 0.230295 0.230664 0.212795 0.216653 0.254732 0.253388 0.251648 0.255492
chargesum: 0.00000
title: Mulliken charges with hydrogens summed into heavy atoms:
elementType: Cl O O C C C C C C C C C C C C C C C C C
charge: -0.068776 -0.321046 -0.267141 0.396619 0.103766 -0.027124 -0.017561 -0.101403 -0.100243 -0.029506 0.446773 -0.131242 -0.114732 0.043735 0.363779 -0.075085 -0.096105 0.043697 0.067206 -0.115609
polarizability: 2.80149669e+02 1.86926693e+01 1.95148635e+02 -1.73089166e+00 2.94414409e+00 1.32498348e+02
1716.lowfreq: -12.8536 -4.2614 -1.7856 -0.0025 -0.0024 -0.0022 9.5118 20.5192 22.2083
frequency: 9.0468 20.4194 22.0018 27.1101 36.5912 66.7960 74.3067 79.0489 89.3667 113.9697 136.8700 150.6522 166.0291 178.5299 227.1836 236.8138 253.9737 279.7172 297.1388 313.6316 320.6899 357.5637 363.3408 377.7418 413.0832 415.5611 442.2937 451.7151 461.9365 477.8850 499.4380 533.0625 568.2339 621.0980 637.7463 663.5311 696.6326 702.9049 759.9582 785.1756 789.2472 800.9386 821.7186 822.9006 857.8975 884.8531 925.4281 927.9972 933.3536 944.3021 951.1996 972.4048 987.0315 989.8314 1006.9704 1024.8945 1032.5451 1038.1572 1057.1462 1070.3040 1071.9686 1088.8392 1107.9531 1132.8647 1135.0732 1169.9944 1171.9631 1192.5371 1205.6651 1211.1685 1233.7848 1239.8889 1251.3415 1288.9320 1311.1915 1319.3016 1327.4636 1338.5025 1350.4130 1368.2634 1383.8662 1389.0607 1398.5317 1399.8198 1404.0962 1428.5310 1454.8944 1461.3344 1464.1969 1467.5130 1470.9447 1474.6896 1476.2388 1483.1569 1484.7913 1492.0510 1493.5101 1582.4909 1602.5869 1690.5806 2956.0793 2966.6506 2974.8213 2979.0733 2983.8544 2986.1398 2997.8352 3027.4602 3035.9062 3041.4205 3044.7567 3051.1452 3067.7060 3069.0993 3072.2599 3082.9234 3097.0679 3103.1295 3105.8576 3155.3921 3156.8642 3174.0019 3177.9738
redmass: 4.0418 5.2400 4.5709 3.8749 3.2717 4.6839 2.1294 3.0023 2.4890 1.4373 6.6864 1.4301 2.0280 3.0665 1.2034 6.2326 2.9393 2.7204 3.7794 3.7811 3.5371 2.7417 2.4878 3.8439 3.0438 3.0177 4.1240 3.0854 4.2067 2.5444 2.7045 3.3547 2.3017 6.8894 6.1334 3.7025 3.4174 2.7360 3.6376 1.4257 2.0719 1.3386 2.4471 1.6853 2.2231 1.6937 1.3867 3.0734 2.4665 1.7924 1.3441 1.8383 1.6651 3.7519 1.5271 1.7736 1.7322 1.5478 1.6715 2.2702 1.8547 1.9931 1.3002 2.5849 2.0671 1.3465 1.2853 1.1848 1.2805 3.2792 1.3825 1.5884 1.8196 1.2644 1.4242 1.4067 1.5279 1.3215 1.5417 3.8883 1.5403 1.3276 1.2072 1.2840 3.7419 1.9361 1.0806 1.0852 1.1974 1.0712 1.7145 1.2826 1.1107 1.0466 1.1482 1.0623 1.0894 7.4411 6.6738 6.7459 1.0592 1.0613 1.0396 1.0360 1.0448 1.0539 1.0653 1.1020 1.0963 1.1000 1.0961 1.0911 1.0983 1.0961 1.0981 1.1009 1.0954 1.0975 1.0902 1.0878 1.0884 1.0965 1.0977
irintensity: 0.6349 0.2920 0.0201 0.4618 0.6361 0.0476 0.0586 0.1632 0.3877 1.2545 2.7263 0.1124 0.1012 2.1510 0.7111 1.8969 0.2668 2.8400 0.8202 1.0702 1.0436 2.0643 2.9255 1.3984 1.1031 0.1656 4.0453 1.0353 10.9815 1.4602 23.4385 9.7902 10.2458 0.6868 57.5270 5.6738 0.4878 4.5472 7.6062 10.0112 6.7979 9.5571 10.7549 84.1361 2.3691 12.1375 3.7179 101.8264 58.6024 6.8112 0.0975 1.9336 2.5400 32.0584 14.3052 2.7958 3.4325 1.0573 7.6087 12.4244 44.7889 17.1369 12.7883 0.5951 7.3540 19.6291 64.7744 4.0845 10.4733 274.3224 1.0335 5.1318 8.5785 2.3320 2.9173 1.9641 0.6049 9.7673 2.4361 6.9057 19.5367 27.3676 11.1135 32.9606 0.6524 3.6604 4.4383 7.5657 41.7786 16.1434 212.1388 24.8917 13.1147 9.1709 4.5985 15.2640 9.9434 17.8013 25.5688 25.6880 36.7882 34.3983 24.0995 25.0427 23.9934 30.4277 30.1133 23.7123 30.6425 8.4727 20.6115 5.4581 30.8686 41.8671 61.3043 45.6838 22.7981 24.6620 32.0314 10.8748 1.5100 9.9677 0.9358
temp: 298.150 k
press: 1.00000 atm
elementType: 17 8 8 6 6 6 6 6 6 6 6 6 6 6 6 6 6 6 6 6 1 1 1 1 1 1 1 1 1 1 1 1 1 1 1 1 1 1 1 1 1 1 1
symmnumber: 1
zpe: 936049.9 jmol-1
zpe.correction: 0.356523 hartree
zpe.thermalcorrener: 0.378811 hartree
zpe.thermalcorrenthalpy: 0.379755 hartree
zpe.thermalcorrgfe: 0.300356 hartree
zpe.sumelectzpe: -1270.524475 hartree
zpe.sumelectthermal: -1270.502186 hartree
zpe.sumelectthermalent: -1270.501242 hartree
zpe.sumelectthermalfe: -1270.580641 hartree
dipole: 1.6155 2.9837 -2.1168
dipole: 3.9991
quadrupole: -154.4052 -114.9344 -132.7860
quadrupole: 3.2724 -9.7401 3.6741
quadrupole: -20.3634 19.1075 1.2559 3.2724 -9.7401 3.6741
hfenergy: -1270.8809972 hartree
pointgroup: C01 [X(C17H23Cl1O2)]
dipole: -0.5915684 -1.2739962 -0.7088812 debye
polarizability: 278.6935486|21.796859|195.3733626|-0.1027795|-9.2217957|133.7297402 unknown
InChI: InChI=1S/C17H23ClO2/c1-4-17(3)16(20-17)10-5-13(2)11-12-19-15-8-6-14(18)7-9-15/h6-9,11,16H,4-5,10,12H2,1-3H3
charge 0 multiplicity 1
43 atoms
Cl 7.022405 1.045837 0.279709
O  -4.499635 1.305138 1.35323
O  1.169547 -0.300591 -0.301503
C  -3.769067 1.482523 0.018327
C  -3.522855 0.256645 0.858996
C  -4.097054 -1.123489 0.587662
C  -2.719449 2.594279 0.052702
C  -4.678478 1.453784 -1.199717
C  -3.222886 -1.960367 -0.394799
C  -1.578443 2.395934 -0.973638
C  -1.772162 -2.13678 0.047361
C  -1.570223 -2.87081 1.360179
C  -0.766811 -1.650993 -0.737467
C  0.709862 -1.709214 -0.474752
C  2.548567 -0.078824 -0.170835
C  3.532332 -1.09977 -0.131285
C  2.934388 1.283073 -0.070325
C  4.897384 -0.753535 0.006735
C  4.292222 1.627381 0.067477
C  5.259578 0.600588 0.102967
H  -2.580321 0.256775 1.428961
H  -4.208404 -1.656891 1.551752
H  -5.115546 -1.029655 0.17026
H  -2.2981 2.638704 1.074551
H  -3.223253 3.565472 -0.124566
H  -4.093158 1.301371 -2.125655
H  -5.435451 0.656359 -1.12986
H  -5.211955 2.41764 -1.29212
H  -3.248203 -1.482148 -1.392099
H  -3.69767 -2.957953 -0.501346
H  -0.857402 3.23176 -0.913063
H  -1.961837 2.368132 -2.010518
H  -1.022913 1.460029 -0.78336
H  -0.510417 -2.990188 1.635755
H  -2.071251 -2.337623 2.190535
H  -2.025369 -3.879431 1.313065
H  -1.036989 -1.132793 -1.668305
H  0.965099 -2.290152 0.431776
H  1.250794 -2.144698 -1.341147
H  3.261251 -2.156668 -0.201716
H  2.158902 2.054193 -0.102741
H  5.662296 -1.534984 0.03848
H  4.593372 2.675937 0.144835
