program: Gaussian 09
title: 000148247
version: EM64L-G09RevD.01
frameworkgroup: C1[X(C3H4N2O3)]
method: RPBEPBE
basis: SDD
operation: Freq
keyword: #pfreq=noraman
keyword: PBEPBE/SDD
title: #p freq=noraman PBEPBE/SDD
converged: YES YES NO NO
title: Mulliken charges:
elementType: O O O N N C C C H H H H
charge: -0.217191 -0.163390 -0.218517 -0.202869 0.115094 -0.379838 -0.298926 0.308697 0.275822 0.279287 0.251520 0.250312
chargesum: 0.00000
title: Mulliken charges with hydrogens summed into heavy atoms:
elementType: O O O N N C C C
charge: -0.217191 -0.163390 -0.218517 -0.202869 0.115094 0.175270 0.202905 0.308697
polarizability: 7.33329149e+01 -5.97779131e-01 6.41548991e+01 -1.37940727e-01 2.88599472e-01 3.16569519e+01
1716.lowfreq: -14.3776 -11.6402 -8.6741 0.0009 0.0010 0.0015 57.2731 123.7351 185.7411
frequency: 57.1192 123.7329 185.7378 203.8640 349.5365 366.8565 538.5176 645.8999 668.4130 678.9679 788.1747 838.2439 925.3055 977.7597 1008.1425 1055.8391 1098.9473 1173.8455 1178.9392 1206.0854 1318.4157 1338.4118 1370.5813 1479.7712 1488.9399 1740.4591 3022.8456 3051.3282 3084.2478 3130.5892
redmass: 1.9894 7.9110 7.0613 8.6357 6.3748 9.7884 10.1250 10.5174 6.1093 10.9021 4.7239 1.3992 4.7590 5.0581 4.5915 5.4107 1.6689 2.4715 1.2907 1.3816 1.7746 1.4396 4.6904 1.0801 1.0818 12.8971 1.0599 1.0614 1.1040 1.1097
irintensity: 0.2226 5.5874 0.0969 6.0567 1.8996 2.1299 20.0862 17.0115 2.1659 18.7427 67.0785 3.1742 27.8733 147.3436 59.3134 429.3520 16.3243 19.4967 2.0123 15.2290 38.9429 17.7165 36.7252 10.8152 2.9430 407.7520 6.8260 28.1833 5.9175 15.2250
temp: 298.150 k
press: 1.00000 atm
elementType: 8 8 8 7 7 6 6 6 1 1 1 1
symmnumber: 1
zpe: 209917.8 jmol-1
zpe.correction: 0.079953 hartree
zpe.thermalcorrener: 0.087144 hartree
zpe.thermalcorrenthalpy: 0.088088 hartree
zpe.thermalcorrgfe: 0.047620 hartree
zpe.sumelectzpe: -451.206164 hartree
zpe.sumelectthermal: -451.198974 hartree
zpe.sumelectthermalent: -451.198030 hartree
zpe.sumelectthermalfe: -451.238498 hartree
dipole: 1.5330 -5.7241 0.0364
dipole: 5.9260
quadrupole: -56.2901 -46.9492 -42.3294
quadrupole: -4.8821 0.4067 -0.0956
quadrupole: -7.7672 1.5737 6.1935 -4.8821 0.4067 -0.0956
hfenergy: -451.2861179 hartree
pointgroup: C01 [X(C3H4N2O3)]
dipole: -0.5436969 2.2670658 0.0227032 debye
dipolederiv: -0.8006204 0.4265215 0.0349275 0.2734364 -0.9699021 -0.0398526 0.0026965 0.0016929 -0.2960942 -0.5046957 -0.0695091 0.0120964 -0.2018504 -1.1444986 0.0025662 0.0105629 0.0007086 -0.3095929 -0.9910089 0.1136823 0.0055426 -0.6886339 -0.2062258 0.0152805 0.057316 0.0025511 -0.1702432 -1.6236756 -0.2228265 0.0424679 0.0292 -0.3981097 0.0114124 0.0364916 0.0026204 -0.1267019 1.7784271 -0.1281404 -0.022216 0.043555 0.0435076 -0.0070881 -0.0423102 -0.0070354 -0.0131559 -0.0423548 -0.0178845 0.0142215 0.1608764 0.1123295 -0.0283689 -0.0251281 -0.013185 0.2949742 0.2321702 0.0585704 0.0090513 -0.1134165 0.5811973 0.0512398 0.0012213 0.0258037 0.347328 1.7610244 -0.0930946 -0.0681352 0.3982832 1.9151801 -0.0025524 -0.0398199 -0.0106723 0.3562619 0.0433159 -0.0159364 0.0477278 0.0182293 0.0442693 0.0243742 0.0427975 0.0655198 -0.0459993 0.0321899 -0.0601819 -0.0594533 -0.0061041 0.0465963 -0.0277776 -0.0397809 -0.0593354 0.0200029 0.0664625 -0.0210122 0.0315103 0.0287701 -0.0085525 -0.0427728 0.0675636 -0.0957202 -0.0697318 0.0487656 0.0298113 -0.0477407 0.0576545 -0.0157913 0.0435392 -0.0716103 0.0870517 0.0129524 unknown
polarizability: 73.2712105|-0.8464707|64.1903879|-1.0130969|-0.3635612|31.6831674 unknown
InChI: InChI=1S/C3H4N2O3/c6-3-5(4-7)1-2-8-3/h1-2H2
charge 0 multiplicity 1
12 atoms
O  -1.859872 0.106334 0.014438
O  -0.888796 -2.026805 0.017537
O  2.628141 0.230511 -0.066206
N  0.417109 -0.005667 -0.011986
N  1.678721 -0.620339 -0.000874
C  0.174779 1.449123 -0.103338
C  -1.360945 1.515461 0.118311
C  -0.78206 -0.800811 0.012323
H  0.491704 1.824126 -1.092353
H  0.753655 1.984647 0.667164
H  -1.628053 1.881277 1.122459
H  -1.885382 2.098144 -0.652374
