program: Gaussian 09
title: 000148233
version: EM64L-G09RevD.01
frameworkgroup: C1[X(C7H7NO3)]
method: RPBEPBE
basis: SDD
operation: Freq
keyword: #pfreq=noraman
keyword: PBEPBE/SDD
title: #p freq=noraman PBEPBE/SDD
converged: YES YES NO NO
title: Mulliken charges:
elementType: O O O N C C C C C C C H H H H H H H
charge: -0.329507 -0.249293 -0.374484 -0.325684 0.376027 -0.393351 -0.323320 -0.194525 -0.206673 -0.248033 0.301274 0.253042 0.301328 0.231558 0.230147 0.230928 0.339877 0.380689
chargesum: 0.00000
title: Mulliken charges with hydrogens summed into heavy atoms:
elementType: O O O N C C C C C C C
charge: -0.329507 -0.249293 0.006205 0.014193 0.376027 -0.140309 -0.021993 0.037033 0.023475 -0.017105 0.301274
polarizability: 1.43271691e+02 -1.64156345e-01 9.51580182e+01 -5.35896157e-01 2.80354218e-01 3.96554933e+01
1716.lowfreq: -7.6882 -0.0005 0.0003 0.0007 2.1604 12.2795 28.4437 49.9571 107.3733
frequency: 27.7779 49.9339 107.3648 157.7651 175.5409 240.5967 281.0680 317.1523 338.5030 410.4921 497.1297 524.3213 591.4660 606.0766 671.0348 692.3186 699.2814 763.6750 792.0517 842.1603 919.9419 935.9549 975.2014 986.7549 994.1212 1017.6795 1031.6862 1081.1814 1162.6081 1166.9505 1171.4315 1196.2284 1313.5304 1345.5490 1383.6163 1439.3999 1444.5993 1472.7070 1593.1103 1608.4509 1679.6981 3133.2324 3144.2130 3160.8678 3173.8149 3204.3013 3508.0955 3561.8743
redmass: 5.7133 7.1938 2.5476 5.2537 1.5615 5.6310 6.4894 6.0954 7.9228 2.9519 3.0222 1.3619 7.6691 6.1691 11.0666 2.6384 4.7835 1.5037 6.9267 1.2497 1.4147 5.5686 1.3584 6.1563 1.3047 3.8466 2.7476 1.5153 2.0045 2.1993 1.1435 1.6656 1.3193 1.4468 9.2660 1.4525 1.8403 2.2174 6.3710 6.4806 10.5389 1.0853 1.0903 1.0950 1.0996 1.0949 1.0687 1.0789
irintensity: 3.2851 2.1674 15.5840 8.2100 80.9891 0.0849 6.6533 0.5479 9.1737 0.0083 4.8707 237.1277 3.1696 5.1346 16.7354 26.8097 30.1519 92.4287 1.8285 0.0435 9.6408 27.1688 0.1317 4.4608 1.7884 48.7453 170.8200 13.9819 337.3652 118.7652 1.7558 163.1946 2.0133 244.9890 10.2509 60.2739 27.4368 90.2303 25.4232 19.3006 227.5633 0.0551 16.6435 25.6339 9.5565 4.6016 31.0252 48.6441
temp: 298.150 k
press: 1.00000 atm
elementType: 8 8 8 7 6 6 6 6 6 6 6 1 1 1 1 1 1 1
symmnumber: 1
zpe: 344479.7 jmol-1
zpe.correction: 0.131205 hartree
zpe.thermalcorrener: 0.141505 hartree
zpe.thermalcorrenthalpy: 0.142449 hartree
zpe.thermalcorrgfe: 0.093995 hartree
zpe.sumelectzpe: -550.509707 hartree
zpe.sumelectthermal: -550.499407 hartree
zpe.sumelectthermalent: -550.498463 hartree
zpe.sumelectthermalfe: -550.546918 hartree
dipole: 0.5425 -1.8975 1.0373
dipole: 2.2296
quadrupole: -52.6176 -58.7598 -66.5489
quadrupole: 3.4263 -5.2219 0.8322
quadrupole: 6.6912 0.5489 -7.2401 3.4263 -5.2219 0.8322
hfenergy: -550.6409122 hartree
pointgroup: C01 [X(C7H7N1O3)]
dipole: -0.1478401 0.8567005 0.1168111 debye
dipolederiv: -2.3715685 0.2524958 0.0381348 0.5754144 -0.4586857 0.0987672 -0.0471234 0.1166893 -0.2634816 -0.7099953 0.0100779 0.0089915 0.0685219 -0.8956602 0.1983282 -0.0432607 0.2642914 -0.4299592 -0.6024936 -0.0991922 -0.011784 0.1626814 -0.3211737 -0.0047976 0.1118499 0.0782083 0.0155628 -0.5903737 -0.3058098 0.0510661 -0.8141118 -0.3677629 -0.026798 -0.1473647 -0.1999689 -0.3356013 1.5728391 -0.0569011 -0.1286942 0.1921855 0.123538 -0.0071574 -0.2830801 0.0125772 0.1157034 -0.3313735 0.0364946 -0.0092644 0.1162339 -0.0200749 -0.0751772 -0.0342373 -0.0643362 -0.1515582 -0.3013896 -0.0251072 0.0172914 -0.1701963 -0.1082642 0.0027553 0.0881002 -0.0167825 -0.1572129 0.0980685 -0.0445132 -0.0141279 -0.0685603 0.0764649 -0.0731405 -0.0103976 -0.0773803 -0.1196449 0.0490545 0.0119596 -0.0325048 0.0509955 0.114138 -0.0974772 -0.0413663 -0.0999302 -0.10727 0.0171473 0.0293286 -0.0394788 0.0078139 -0.1374195 -0.0176525 -0.0266931 -0.0176193 -0.1644639 2.4875306 0.0645734 -0.0084722 -0.2680229 1.296146 -0.3677558 0.2132438 -0.4164598 0.4941589 0.0806087 -0.0647685 0.0374564 -0.0606948 -0.0008417 0.0708342 0.0355844 0.0724198 0.1470301 0.1494936 0.0555795 -0.0086357 0.0540948 0.0815675 0.0298607 -0.0073599 0.0351147 0.1743123 -0.0050456 0.0992577 -0.016433 0.1066214 -0.0244777 0.0538349 -0.0170715 0.0548898 0.1417783 0.0437825 -0.0516567 0.031821 -0.0708572 -0.0524111 0.0832569 0.039447 0.0822263 0.1225221 -0.1218918 -0.0178345 0.043102 -0.0186295 0.0983956 0.0282253 0.0442464 0.0292168 0.1532888 0.1578297 0.0635097 0.0161703 0.1248373 0.2762102 0.0699444 0.0672752 0.1220903 0.2916597 0.3777772 0.0425063 0.0253614 0.0116728 0.3203113 0.0341491 0.0582077 0.0247533 0.0731757 unknown
polarizability: 142.5202052|-4.9910267|87.8091146|-6.9120507|-18.7978993|47.7558826 unknown
InChI: InChI=1S/C7H7NO3/c9-7(8-10)11-6-4-2-1-3-5-6/h1-5,8,10H
charge 0 multiplicity 1
18 atoms
O  0.840516 0.532542 -0.498557
O  1.879533 -1.434733 0.39266
O  4.308228 -0.296803 -0.530588
N  3.075902 0.436354 -0.375769
C  -0.528286 0.253402 -0.192483
C  -1.395012 1.333106 -0.472201
C  -1.012242 -0.975426 0.311773
C  -2.778281 1.184263 -0.240372
C  -2.402897 -1.100502 0.539819
C  -3.288524 -0.033758 0.268407
C  1.920645 -0.297883 -0.122998
H  -0.977293 2.265356 -0.863995
H  -0.328509 -1.799243 0.520259
H  -3.453846 2.018932 -0.456373
H  -2.790124 -2.047416 0.931913
H  -4.362463 -0.14862 0.44907
H  3.046212 1.260466 -0.979948
H  4.590841 -0.513936 0.399183
