program: Gaussian 09
title: 000148286
version: EM64L-G09RevD.01
frameworkgroup: C1[X(C20H25ClN4O2)]
method: RPBEPBE
basis: SDD
operation: Freq
keyword: #p
keyword: freq=noraman
keyword: PBEPBE/SDD
title: #p freq=noraman PBEPBE/SDD
converged: YES YES NO NO
title: Mulliken charges:
elementType: Cl O O N N N N C C C C C C C C C C C C C C C C C C C C H H H H H H H H H H H H H H H H H H H H H H H H H
charge: -0.058514 -0.454444 -0.255720 -0.127261 -0.398376 -0.059140 -0.092558 -0.344692 -0.424091 -0.362577 -0.344744 -0.329432 0.323888 0.280901 -0.052399 -0.325080 -0.672036 -0.098086 0.011822 -0.315980 -0.300487 -0.232461 -0.292273 -0.107080 0.057634 -0.307349 -0.535179 0.198053 0.213030 0.184836 0.212637 0.211267 0.304283 0.220596 0.220170 0.204684 0.191485 0.282203 0.190761 0.198027 0.210902 0.234268 0.213718 0.190397 0.290743 0.274879 0.255074 0.257609 0.346842 0.255572 0.224766 0.228912
chargesum: 0.00000
title: Mulliken charges with hydrogens summed into heavy atoms:
elementType: Cl O O N N N N C C C C C C C C C C C C C C C C C C C C
charge: -0.058514 -0.107602 -0.255720 -0.127261 -0.116173 -0.059140 -0.092558 0.066391 -0.026618 0.152973 0.096022 0.066738 0.323888 0.280901 -0.052399 0.063708 -0.013149 -0.098086 0.011822 -0.125583 -0.009745 0.042418 -0.037200 -0.107080 0.057634 -0.049740 0.174072
polarizability: 4.17687737e+02 -5.30797604e+01 3.00585906e+02 3.06091040e+01 2.51033437e+01 1.63284600e+02
1716.lowfreq: -7.1254 -3.2245 -0.0012 -0.0007 0.0006 6.3530 9.4036 20.7133 36.4314
frequency: 6.8558 20.5620 36.4284 39.1762 42.4344 51.8272 65.9605 72.2109 85.1137 93.8589 113.8202 122.7742 138.1180 151.4265 164.2600 175.9774 183.7783 202.6699 212.9573 249.8599 254.2903 261.4727 274.5464 282.7936 289.5597 296.6154 313.3743 337.4566 368.2873 383.2731 395.3870 412.5469 413.8056 429.9637 463.3600 466.1523 480.5482 493.2867 510.5487 542.1620 559.1718 578.6506 596.7921 618.1838 637.7281 671.0871 675.6021 679.1633 734.6460 738.7195 765.8648 770.0787 798.1040 806.2557 809.4038 829.1623 839.2109 861.9442 866.8542 893.1097 894.0171 925.8056 927.9628 946.5085 952.3588 977.9579 983.8426 988.6603 1012.2808 1041.8158 1056.2871 1064.8442 1069.2971 1080.5646 1084.8876 1095.4004 1104.9912 1116.6690 1141.4445 1146.5925 1153.5937 1163.2790 1175.6813 1199.0968 1207.9682 1226.8825 1230.9521 1235.4622 1252.6863 1254.8849 1278.9525 1283.0684 1286.6577 1291.5344 1294.3150 1325.5395 1344.3184 1354.2513 1357.3341 1363.7503 1373.3324 1381.9641 1395.2829 1396.2348 1411.2437 1416.7148 1428.7618 1450.2901 1450.6115 1455.9877 1461.8362 1462.8196 1467.8089 1473.3540 1475.5748 1479.9737 1486.3627 1488.8827 1497.6655 1505.7240 1522.3790 1547.6968 1561.5334 1597.3520 1613.7746 2861.0345 2874.6821 2919.2470 2941.9544 2945.1688 2961.0563 2982.2585 2988.5392 2995.6031 3020.2871 3027.0764 3049.0682 3058.3228 3079.0511 3080.2730 3094.5635 3113.2063 3122.4812 3129.4983 3161.4218 3174.0286 3181.0249 3185.2935 3523.8414 3577.4591
redmass: 4.8771 4.6166 5.4882 5.3659 4.4371 4.6000 3.1053 2.0308 3.3600 3.7240 2.7382 5.1527 3.5130 3.1358 4.0557 1.7673 4.1897 1.2679 3.0027 1.5105 5.1990 1.3310 3.0756 4.9707 3.3126 3.8932 3.4287 4.9903 2.8224 2.9310 5.3672 3.3613 2.3302 6.0728 5.4479 2.9552 3.0007 5.3366 3.0767 2.3736 2.9202 2.9020 5.9343 4.1859 7.4876 5.7369 6.5797 6.7090 2.7903 2.5530 6.4540 2.1135 1.1942 3.3991 1.3382 1.6004 1.7326 5.9189 2.8031 4.2238 1.5445 1.4058 2.3136 2.1291 4.6899 6.0409 1.3191 3.7410 2.5177 2.2421 2.4902 2.0843 1.6474 2.0355 2.2386 2.2243 1.9685 1.2585 1.8299 1.5272 1.5362 1.5844 2.0102 1.3136 1.2531 1.6599 1.7859 2.0018 1.5096 4.4102 1.3489 1.2706 2.0248 1.7857 1.3475 1.5782 1.4467 1.4643 2.2533 1.3543 1.3629 5.3551 1.7653 2.5984 1.4626 1.6589 2.4895 1.1058 1.3851 1.7796 1.6037 1.1244 1.0973 1.0923 1.0681 1.0806 1.0800 1.0797 1.0882 6.5489 6.8054 4.1872 3.4313 5.6648 7.2321 1.0716 1.0713 1.0695 1.0553 1.0699 1.0693 1.0309 1.0363 1.1038 1.0878 1.0921 1.0893 1.0930 1.0987 1.1040 1.0997 1.0878 1.0901 1.1033 1.0886 1.0949 1.0933 1.0994 1.0738 1.0666
irintensity: 0.0409 0.5902 0.5714 0.0846 0.0611 0.0290 0.6540 0.2438 5.6432 4.8089 4.0567 0.6593 5.8930 5.5618 0.2750 6.3000 1.5824 0.1475 10.7932 51.4886 0.5236 101.0151 1.7594 2.0733 2.6415 4.9207 11.5342 11.1703 2.0382 2.8331 0.5686 3.8235 3.7681 3.2946 10.7566 9.6633 1.0236 9.6925 6.1820 34.8199 3.4403 54.1690 3.3668 14.0435 1.1591 4.5083 24.3212 5.8192 27.3189 14.1758 12.1397 20.2458 6.7813 17.7688 6.2218 0.3849 44.2168 10.4899 16.7864 80.5839 26.3974 1.0956 5.9876 14.3982 71.6965 93.0883 0.7392 6.1261 53.5496 6.3169 18.7307 29.0517 14.7035 20.8909 3.8362 10.0463 5.7473 0.9155 22.7498 9.3580 12.4278 29.7919 3.0068 43.6829 63.1493 23.2399 47.2247 64.9168 12.9978 120.3225 1.9228 1.2320 3.5855 9.1935 18.7520 21.8556 1.2461 18.7447 127.1399 8.2491 0.0745 85.0265 16.1893 4.9442 0.5163 18.8742 65.6865 31.5497 40.7979 64.8192 14.3299 13.8273 1.9574 14.1372 22.2238 18.5738 22.4459 14.6656 34.4550 48.0485 84.9757 361.6526 26.0148 4.9041 181.9540 64.3170 123.0677 70.8698 103.3381 38.7635 96.2214 39.5596 17.6568 56.5091 18.9939 16.4352 45.1505 44.8442 46.7515 32.7041 29.4213 14.3283 11.9862 32.0182 0.3028 4.5076 1.4462 9.1468 21.7806 6.0825
temp: 298.150 k
press: 1.00000 atm
elementType: 17 8 8 7 7 7 7 6 6 6 6 6 6 6 6 6 6 6 6 6 6 6 6 6 6 6 6 1 1 1 1 1 1 1 1 1 1 1 1 1 1 1 1 1 1 1 1 1 1 1 1 1
symmnumber: 1
zpe: 1102784.9 jmol-1
zpe.correction: 0.420029 hartree
zpe.thermalcorrener: 0.447198 hartree
zpe.thermalcorrenthalpy: 0.448143 hartree
zpe.thermalcorrgfe: 0.359368 hartree
zpe.sumelectzpe: -1604.612273 hartree
zpe.sumelectthermal: -1604.585103 hartree
zpe.sumelectthermalent: -1604.584159 hartree
zpe.sumelectthermalfe: -1604.672934 hartree
dipole: -5.0446 -1.8251 -1.3193
dipole: 5.5244
quadrupole: -185.3677 -161.7515 -165.5515
quadrupole: -11.8676 -0.0632 4.0746
quadrupole: -14.4774 9.1387 5.3387 -11.8676 -0.0632 4.0746
hfenergy: -1605.0323019 hartree
pointgroup: C01 [X(C20H25Cl1N4O2)]
dipole: -2.0888836 -0.1739628 -0.5746971 debye
polarizability: 402.1995009|-70.3167805|266.2493711|-9.6379435|77.7896394|213.1093709 unknown
InChI: InChI=1S/C20H25ClN4O2/c1-3-25(11-12-26)10-4-9-22-19-15-6-5-14(21)13-17(15)23-16-7-8-18(27-2)24-20(16)19/h5-8,13,22,26H,3-4,9-12H2,1-2H3
charge 0 multiplicity 1
52 atoms
Cl 6.786764 -2.462079 -1.13588
O  -6.941724 -0.465713 -0.302993
O  -1.749182 3.076896 1.251789
N  -3.393129 -1.563398 0.169987
N  0.095824 -0.793163 -1.584961
N  3.318693 0.892832 0.733089
N  -0.347097 1.48875 0.211627
C  -2.514119 -2.334617 -0.749953
C  -2.211763 -1.574773 -2.061274
C  -1.291981 -0.353909 -1.857181
C  -4.823467 -1.60094 -0.239699
C  -3.218977 -1.949658 1.601365
C  1.099175 -0.20645 -0.840961
C  2.445816 -0.752764 -0.931575
C  0.909472 0.910266 0.053068
C  -5.527057 -0.268701 0.053443
C  -1.896292 -1.458791 2.217135
C  3.502678 -0.166558 -0.120527
C  2.053473 1.404186 0.802196
C  2.791898 -1.850302 -1.790627
C  4.834036 -0.708552 -0.195732
C  1.829955 2.514609 1.701058
C  4.087935 -2.362924 -1.855497
C  5.099153 -1.773936 -1.039852
C  -0.497184 2.498376 1.064204
C  0.570427 3.068885 1.844861
C  -2.858216 2.503252 0.463657
H  -2.956325 -3.332709 -0.992327
H  -1.556481 -2.527252 -0.234024
H  -1.7604 -2.280301 -2.793288
H  -3.156063 -1.223899 -2.520045
H  -1.303923 0.283976 -2.767141
H  -1.634711 0.256594 -1.012924
H  -4.896735 -1.794447 -1.324535
H  -5.38392 -2.419434 0.268672
H  -4.059047 -1.504652 2.167294
H  -3.308375 -3.058392 1.728978
H  0.390046 -1.57788 -2.169679
H  -5.419884 -0.002122 1.126917
H  -5.063996 0.535005 -0.556953
H  -1.851591 -1.731791 3.287699
H  -1.809624 -0.3623 2.127165
H  -1.013516 -1.903737 1.724232
H  2.046554 -2.325691 -2.439703
H  5.600703 -0.246085 0.430373
H  2.696255 2.884335 2.257213
H  4.332739 -3.19699 -2.518575
H  0.359782 3.905621 2.515234
H  -7.445802 0.370032 -0.139996
H  -2.965987 1.421996 0.661667
H  -3.747275 3.061465 0.793315
H  -2.678833 2.652134 -0.616337
