program: Gaussian 09
title: 000148318
version: EM64L-G09RevD.01
frameworkgroup: C1[X(C24H21NO8)]
method: RPBEPBE
basis: SDD
operation: Freq
keyword: #p
keyword: freq=noraman
keyword: PBEPBE/SDD
title: #p freq=noraman PBEPBE/SDD
converged: YES YES NO NO
title: Mulliken charges:
elementType: O O O O O O O O N C C C C C C C C C C C C C C C C C C C C C C C C H H H H H H H H H H H H H H H H H H H H H
charge: -0.294593 -0.295243 -0.287158 -0.265303 -0.262771 -0.256468 -0.264583 -0.256584 -0.117355 -0.311632 -0.037739 -0.493827 -0.363962 0.499138 -0.388124 -0.449257 -0.456025 0.222330 0.247989 0.215178 -0.466307 -0.327418 0.258499 0.215062 -0.320198 0.182852 -0.468689 -0.311086 0.207622 0.181934 -0.347908 -0.202460 -0.202367 0.239678 0.272242 0.257889 0.229124 0.225383 0.192835 0.191070 0.224898 0.251668 0.243958 0.248606 0.289110 0.274877 0.255180 0.291804 0.295199 0.268510 0.241668 0.242547 0.239863 0.240344
chargesum: 0.00000
title: Mulliken charges with hydrogens summed into heavy atoms:
elementType: O O O O O O O O N C C C C C C C C C C C C C C C C C C C C C C C C
charge: -0.294593 -0.295243 -0.287158 -0.265303 -0.262771 -0.256468 -0.264583 -0.256584 -0.117355 -0.071954 0.234504 -0.006815 0.054256 0.499138 0.027844 -0.197589 0.036539 0.222330 0.247989 0.215178 -0.177198 -0.052541 0.258499 0.215062 -0.065017 0.182852 -0.176885 -0.015887 0.207622 0.181934 -0.079399 0.281754 0.277839
polarizability: 3.31917998e+02 -3.49546120e+01 3.29678366e+02 -3.45159727e+01 1.58800504e+01 2.36642014e+02
1716.lowfreq: -41.5114 -17.5416 -10.3018 -4.6146 -0.0003 0.0002 0.0002 1.8128 4.3615
frequency: -41.4853 -17.2157 -2.1731 13.0047 17.4212 30.1832 34.6971 44.0774 58.1354 65.9018 76.6390 92.2619 98.0644 119.4467 137.0207 162.3155 171.0582 205.4982 219.7332 223.5455 232.4483 244.9620 245.9345 261.5085 302.3958 309.7824 326.3607 347.8920 362.3695 374.6250 386.9292 410.5860 421.1188 421.9581 489.8407 503.3227 538.9920 551.5459 559.9325 563.8241 565.9422 572.5180 622.1752 642.6682 650.1605 681.1751 681.4148 696.3013 701.1284 702.6642 708.1645 737.2028 739.8735 769.9278 772.7495 779.6981 787.3851 799.0199 812.1748 829.2058 837.7288 838.6378 841.0750 847.1674 871.6604 887.7619 892.1672 903.0146 910.9591 912.6073 912.7570 935.9436 956.5118 959.4367 973.6890 974.2000 975.1951 985.0004 997.8513 1005.5110 1033.1149 1042.4566 1050.1749 1064.1407 1065.1343 1066.9935 1072.5718 1084.8998 1119.7603 1120.5135 1122.4297 1134.2814 1136.7455 1139.1603 1145.5596 1166.8990 1174.1561 1194.7510 1195.7364 1202.9613 1217.8747 1235.1020 1250.9005 1255.0748 1257.9218 1262.4642 1267.4816 1279.2034 1299.1858 1308.3075 1335.0948 1345.0805 1353.6585 1355.0322 1364.3493 1364.4028 1393.2196 1394.8451 1449.2456 1449.8469 1457.2793 1457.5285 1470.9402 1472.3162 1478.8972 1485.5966 1486.6679 1503.3403 1587.8374 1593.7117 1610.7808 1614.2011 1624.5476 1625.3313 1674.4027 2878.1064 2925.0427 2929.2458 2962.7477 2986.2767 3010.9531 3015.5845 3017.8040 3026.3454 3061.5002 3094.1344 3094.5250 3095.4211 3098.8543 3157.8905 3173.4065 3184.4208 3185.9031 3186.1698 3191.7091 3208.1813
redmass: 2.2468 2.2279 7.0948 5.5809 7.6034 6.0215 6.1318 4.7971 5.9646 9.6744 4.9330 7.3496 6.1062 7.0320 5.4306 5.8692 3.0894 5.9149 5.8957 5.9331 5.5789 7.5336 4.0410 2.7040 7.4049 7.7085 4.5672 7.2299 5.6381 3.7398 4.0964 3.1210 3.1376 3.1230 5.0362 5.5260 5.2609 5.9081 5.6958 5.6348 6.5408 5.8844 5.4559 7.4874 6.4583 9.5850 9.5879 5.8802 6.2645 6.6294 3.5533 4.1339 4.3598 6.1772 5.7378 2.8865 4.2295 4.0174 1.8398 1.4353 8.0406 8.3760 1.4314 2.6805 6.6370 3.8909 2.3024 4.0112 1.4366 2.0923 2.5395 2.4874 1.3528 2.4067 4.9256 1.4757 5.2977 1.8452 1.8483 1.9292 2.0491 2.6070 2.6736 1.4595 1.4592 3.1179 3.4381 3.9814 1.0368 1.0408 3.1582 1.5877 1.4158 1.4017 1.6991 1.1606 1.7014 1.6678 1.3374 2.2372 2.1068 1.3237 2.6353 2.8904 2.1146 1.3880 1.6298 1.2775 1.4481 1.5773 1.5396 1.4864 2.7025 1.4509 1.3066 1.3078 4.8496 4.9440 4.5603 4.5737 1.1047 1.1001 2.6463 2.5439 1.0839 1.2667 1.2949 1.0853 10.9414 10.0226 8.6362 9.1882 8.4460 8.3923 7.5415 1.0711 1.0803 1.0723 1.0878 1.0613 1.0757 1.0534 1.0538 1.0820 1.1012 1.0883 1.1190 1.1013 1.1187 1.0966 1.0891 1.0918 1.0930 1.0935 1.0971 1.0945
irintensity: 13.9158 12.7000 0.3729 1.9383 0.9574 0.7375 0.1634 0.1427 0.4557 0.7293 2.6640 1.5547 0.9006 2.2965 0.4366 4.0206 3.6800 0.6016 0.2650 0.2704 5.3523 20.5284 4.8922 8.5908 0.2718 0.9758 10.8930 1.1960 3.7960 2.4265 4.8153 8.1833 3.0605 1.0535 7.8715 5.6628 4.0790 10.7233 3.2088 0.5423 7.7553 1.2122 18.4322 3.2422 3.5580 0.6084 1.8101 2.3255 20.9592 10.6264 1.9639 23.6212 19.8326 12.9442 7.2906 14.9777 8.3479 13.1384 41.3135 25.5472 32.3370 45.2495 31.4773 9.4787 9.9037 27.2670 5.2536 20.1019 28.1039 61.6183 71.7026 14.7113 0.1378 5.0952 160.7856 26.9143 292.8106 11.8301 11.0063 3.4268 13.7193 97.5149 27.5295 4.8048 5.6620 69.5866 160.7242 180.1228 0.0047 0.6715 33.3750 10.1650 21.9350 14.6354 1.7525 5.5577 16.0556 30.8429 29.0329 97.0333 23.0959 10.0801 269.3724 504.5251 244.5692 22.9395 242.4989 4.8814 7.6009 14.6469 25.9025 1.9485 2.5418 6.4768 1.9419 2.4014 63.9582 56.9317 112.6418 152.8702 1.5849 22.5721 77.3785 87.2491 3.4248 22.4265 25.7979 7.5581 203.4885 182.2584 23.6087 55.2285 65.7139 57.6222 0.3268 79.7536 98.4706 26.8043 75.9266 13.8008 18.3589 130.0121 128.5378 75.5169 12.4630 16.9636 30.7685 22.4327 28.6973 10.9847 0.9390 1.6698 4.2361 2.7544 5.0871 14.8832
temp: 298.150 k
press: 1.00000 atm
elementType: 8 8 8 8 8 8 8 8 7 6 6 6 6 6 6 6 6 6 6 6 6 6 6 6 6 6 6 6 6 6 6 6 6 1 1 1 1 1 1 1 1 1 1 1 1 1 1 1 1 1 1 1 1 1
symmnumber: 1
zpe: 1068828.0 jmol-1
zpe.correction: 0.407095 hartree
zpe.thermalcorrener: 0.433055 hartree
zpe.thermalcorrenthalpy: 0.434000 hartree
zpe.thermalcorrgfe: 0.347838 hartree
zpe.sumelectzpe: -1581.259158 hartree
zpe.sumelectthermal: -1581.233198 hartree
zpe.sumelectthermalent: -1581.232253 hartree
zpe.sumelectthermalfe: -1581.318415 hartree
dipole: 2.3823 2.4898 0.1644
dipole: 3.4499
quadrupole: -168.9374 -174.1912 -192.9695
quadrupole: -7.1992 -11.5644 -8.0572
quadrupole: 9.7620 4.5082 -14.2702 -7.1992 -11.5644 -8.0572
hfenergy: -1581.666253 hartree
pointgroup: C01 [X(C24H21N1O8)]
dipole: 0.335161 1.2958557 -0.2250655 debye
polarizability: 358.7736924|-19.6534871|304.0258823|-34.7919139|14.3584198|235.4388025 unknown
InChI: InChI=1S/C24H21NO8/c26-23(14-1-3-17-20(9-14)31-12-29-17)28-11-16-5-7-25-8-6-19(22(16)25)33-24(27)15-2-4-18-21(10-15)32-13-30-18/h1-5,9-10,19,22H,6-8,11-13H2
charge 0 multiplicity 1
54 atoms
O  -1.888908 0.911874 -0.805566
O  -1.139431 -1.66041 1.185885
O  -0.047433 0.363522 -2.131561
O  -0.580023 -3.248538 2.79774
O  3.144347 4.431169 -0.971172
O  2.018279 5.736974 0.702453
O  4.011439 -5.03979 0.894508
O  4.435906 -3.842908 -1.145664
N  -4.816384 0.264231 -0.436104
C  -3.663425 -0.67978 -0.223946
C  -2.624091 -0.288142 -1.307348
C  -3.531335 0.151046 -2.47478
C  -4.671365 0.931501 -1.761946
C  -3.287521 -0.490981 1.23584
C  -4.966628 1.132055 0.766779
C  -4.007841 0.52616 1.775636
C  -2.385513 -1.422721 1.984353
C  -0.604154 1.130122 -1.299314
C  0.016428 2.354286 -0.725392
C  -0.298355 -2.649505 1.727225
C  1.312114 2.718259 -1.206709
C  -0.643103 3.130493 0.26404
C  0.917809 -2.893525 0.909904
C  1.884497 3.861539 -0.660519
C  -0.041754 4.292951 0.808221
C  1.225556 4.634324 0.32426
C  1.829367 -3.88364 1.396121
C  1.175523 -2.191617 -0.296554
C  2.966581 -4.117394 0.632252
C  3.220914 -3.415881 -0.570031
C  2.342323 -2.445068 -1.060567
C  3.280931 5.614756 -0.084434
C  4.974877 -4.88537 -0.224943
H  -3.95467 -1.733243 -0.429924
H  -1.899525 -1.077873 -1.557324
H  -2.99222 0.754605 -3.222468
H  -3.926672 -0.750621 -2.978468
H  -5.611682 0.901546 -2.342386
H  -4.378975 1.998291 -1.636445
H  -4.700123 2.194398 0.543259
H  -6.009826 1.138285 1.145415
H  -3.947263 0.866563 2.814314
H  -2.10405 -1.021311 2.973708
H  -2.861544 -2.410228 2.145721
H  1.807506 2.108856 -1.96619
H  -1.627843 2.809225 0.61164
H  -0.538937 4.895358 1.572013
H  1.617138 -4.416405 2.326021
H  0.471238 -1.4372 -0.649839
H  2.53964 -1.903536 -1.98825
H  4.119636 5.451026 0.614096
H  3.402811 6.519495 -0.7029
H  5.943747 -4.5398 0.174602
H  5.049489 -5.839621 -0.773661
