program: Gaussian 09
title: 000148175
version: EM64L-G09RevD.01
frameworkgroup: C1[X(C9H7NO)]
method: RPBEPBE
basis: SDD
operation: Freq
keyword: #pfreq=noraman
keyword: PBEPBE/SDD
title: #p freq=noraman PBEPBE/SDD
converged: NO YES NO NO
title: Mulliken charges:
elementType: O N C C C C C C C C C H H H H H H H
charge: -0.283548 -0.039143 -0.307482 -0.166320 0.459303 -0.169072 -0.044779 -0.280510 -0.325324 -0.174687 -0.356754 0.234877 0.231488 0.236533 0.259352 0.248886 0.233202 0.243977
chargesum: 0.00000
title: Mulliken charges with hydrogens summed into heavy atoms:
elementType: O N C C C C C C C C C
charge: -0.283548 -0.039143 -0.072604 0.065167 0.459303 0.067461 -0.044779 -0.021157 -0.076438 0.058515 -0.112778
polarizability: 1.51014861e+02 6.02668260e+00 1.02342670e+02 -4.35657738e+00 3.23805325e+00 4.91098661e+01
1716.lowfreq: -3.0235 0.0003 0.0004 0.0005 9.6314 14.1359 127.4123 139.1493 292.3483
frequency: 127.4120 139.1469 292.3481 331.4457 355.2540 420.3618 466.7511 499.1257 558.4620 583.6164 606.8975 670.6909 707.8443 731.6799 770.7740 793.7363 810.9720 837.9374 901.3003 926.3448 941.8353 978.4395 980.7754 1008.7594 1040.4560 1071.3646 1101.8564 1135.9264 1199.8778 1220.9715 1239.3378 1246.9027 1321.6477 1343.7705 1352.5030 1392.1751 1432.9632 1449.2589 1548.7180 1584.6002 1625.1048 3097.5196 3120.3975 3129.6778 3135.3116 3142.2804 3168.3097 3169.6174
redmass: 4.5656 5.1717 5.2426 4.4481 3.9168 3.3100 5.8585 5.9283 5.9414 3.7463 5.1015 4.4665 4.5483 3.2120 3.0461 5.2647 1.3102 3.1537 5.7361 2.0542 1.4901 1.3054 1.4029 1.4386 2.4889 1.3489 1.7769 1.3088 1.4855 1.6639 1.6414 1.6372 5.7031 1.5184 2.7255 1.7613 2.4988 2.9514 6.0905 6.2826 6.7788 1.0892 1.0908 1.0880 1.0923 1.0884 1.0995 1.0991
irintensity: 4.2239 2.8864 7.2962 6.2270 3.3525 1.6409 1.3933 0.9070 6.8364 6.8821 7.3329 3.9199 25.0453 1.3920 17.6004 3.7557 88.2689 29.2750 2.1057 8.1917 1.3053 1.0742 0.9946 11.1299 2.6412 3.6336 5.7353 1.7496 2.5619 1.6354 3.9851 2.5386 1.6996 6.0771 0.9652 3.0194 9.4701 41.8784 14.2959 10.1334 0.3581 16.3839 40.6888 4.0866 22.8567 8.4244 25.0310 18.5799
temp: 298.150 k
press: 1.00000 atm
elementType: 8 7 6 6 6 6 6 6 6 6 6 1 1 1 1 1 1 1
symmnumber: 1
zpe: 357159.8 jmol-1
zpe.correction: 0.136035 hartree
zpe.thermalcorrener: 0.143791 hartree
zpe.thermalcorrenthalpy: 0.144735 hartree
zpe.thermalcorrgfe: 0.103513 hartree
zpe.sumelectzpe: -476.311365 hartree
zpe.sumelectthermal: -476.303609 hartree
zpe.sumelectthermalent: -476.302665 hartree
zpe.sumelectthermalfe: -476.343888 hartree
dipole: -0.3724 -1.5378 -2.4989
dipole: 2.9577
quadrupole: -54.3018 -60.1601 -68.1891
quadrupole: 7.2590 -5.5593 2.8918
quadrupole: 6.5819 0.7236 -7.3055 7.2590 -5.5593 2.8918
hfenergy: -476.4474004 hartree
pointgroup: C01 [X(C9H7N1O1)]
dipole: 0.138953 -0.5628553 1.0089374 debye
dipolederiv: -0.4680272 -0.1439068 -0.0371461 -0.3147535 -0.4025498 -0.0440604 -0.2826344 -0.1891292 -0.5083111 -0.4422847 0.0309676 0.0182707 0.015156 -0.289276 0.0141356 0.0333268 0.0085301 -0.2454669 0.1948062 0.0939716 -0.0328595 0.2113696 0.3157857 -0.0599112 0.0982673 -0.0476444 0.2495363 0.3783117 0.1657004 -0.0467101 0.2572292 0.1704488 -0.0539539 -0.0597156 0.0940554 0.2960568 -0.0422833 -0.0059197 0.0300853 0.2791128 -0.2574293 0.0597683 0.0323342 0.1003405 -0.0058737 -0.1198938 -0.0475125 0.0033068 -0.0662958 0.0718582 0.0228671 0.1211555 0.0140664 -0.2423092 0.3551451 -0.0386709 -0.0233368 -0.3457449 0.1128724 0.0041342 -0.032285 0.010064 0.0619392 -0.0749025 -0.0188274 -0.0417073 -0.0406649 0.1376054 -0.0345419 0.031114 -0.0400372 -0.1370331 0.0933036 0.005805 -0.0259873 -0.0558336 0.1867203 -0.0603829 -0.0255966 -0.0679767 -0.1138127 -0.1342683 -0.0684413 0.0264626 -0.2268027 -0.1218636 0.0155936 0.0539798 0.0177281 -0.122111 0.3317117 0.0165753 -0.0421176 0.2520112 0.1615653 -0.0735523 -0.0779899 -0.05721 -0.0535393 0.0409024 0.0231028 -0.0242941 -0.0599477 -0.091677 0.1146006 -0.0157144 0.0765385 0.0381858 -0.0990169 -0.0459202 0.1126864 -0.0389463 0.0437624 0.0058273 0.0977848 -0.0086558 0.0325357 -0.0239894 0.0949543 0.0289293 0.0875075 -0.0130023 -0.0075547 -0.0035758 -0.0154874 0.1686288 0.0876452 -0.0521999 0.0140978 0.022116 -0.0510823 0.0182474 0.0073582 0.0251689 0.1556572 0.0897473 -0.0528231 0.0151835 -0.0058603 -0.0784144 0.0434085 -0.0043271 0.0422915 0.1348992 -0.051326 0.0910001 -0.0040213 0.1060482 0.037637 0.0163072 -0.0046987 0.0246921 0.160823 -0.1155812 -0.0478553 0.0291577 -0.0757008 0.0670393 0.0190677 0.0312169 0.0126651 0.130195 unknown
polarizability: 150.552053|-7.6327434|102.3177306|-5.051315|-5.5022558|49.5976139 unknown
InChI: InChI=1S/C9H7NO/c1-2-6-7(10-5-1)3-4-8-9(6)11-8/h1-5,8-9H
charge 0 multiplicity 1
18 atoms
O  -2.140896 -1.025705 -0.909372
N  1.590611 1.317734 -0.271174
C  -1.233934 -1.160115 0.305759
C  -2.385759 -0.171907 0.336663
C  0.144198 -0.629315 0.162336
C  -2.069325 1.272068 0.21483
C  0.342909 0.769956 -0.081776
C  -0.792788 1.696145 -0.044286
C  1.282318 -1.458813 0.268097
C  2.56461 -0.901159 0.075241
C  2.665094 0.483967 -0.203715
H  -1.345136 -2.129848 0.808193
H  -3.308252 -0.452107 0.858299
H  -2.8876 1.991694 0.325742
H  -0.551083 2.755969 -0.175297
H  1.165787 -2.528866 0.476281
H  3.466328 -1.51841 0.130163
H  3.642317 0.950512 -0.373084
