program: Gaussian 09
title: 000148075
version: EM64L-G09RevD.01
frameworkgroup: C1[X(C15H9N3O3)]
method: RPBEPBE
basis: SDD
operation: Freq
keyword: #p
keyword: freq=noraman
keyword: PBEPBE/SDD
title: #p freq=noraman PBEPBE/SDD
converged: YES YES NO NO
title: Mulliken charges:
elementType: O O O N N N C C C C C C C C C C C C C C C H H H H H H H H H
charge: -0.190835 -0.276894 -0.107183 -0.447048 0.037635 -0.009514 0.187479 0.217629 0.217010 0.164240 0.267806 -0.152710 -0.518138 0.088027 -0.021871 -0.468172 -0.299041 0.252006 -0.487973 -0.324857 -0.533104 0.373518 0.268256 0.258312 0.248112 0.275026 0.248123 0.262358 0.235898 0.235908
chargesum: 0.00000
title: Mulliken charges with hydrogens summed into heavy atoms:
elementType: O O O N N N C C C C C C C C C C C C C C C
charge: -0.190835 -0.276894 -0.107183 -0.073530 0.037635 -0.009514 0.187479 0.217629 0.217010 0.164240 0.267806 -0.152710 -0.249881 0.088027 -0.021871 -0.209860 -0.050929 0.252006 -0.212948 -0.076735 0.201059
polarizability: 3.75590208e+02 2.06889496e+01 2.03081119e+02 2.22558692e-03 2.89470488e-02 7.72514049e+01
1716.lowfreq: -5.2176 -5.0185 -2.1633 0.0001 0.0006 0.0009 36.1633 56.6949 97.2735
frequency: 36.1540 56.6920 97.2729 114.4045 126.7217 143.0139 172.6165 200.8471 211.2500 243.4938 244.4255 294.1476 305.4613 317.2750 341.2673 402.5508 410.1687 437.8746 469.7871 472.3062 500.2383 508.9369 525.8430 565.8714 597.5178 622.9079 630.1529 681.0775 717.9180 723.0862 752.7364 758.8392 773.5549 785.9852 827.4563 841.9255 844.7751 874.8156 886.3711 890.2534 925.3129 941.6695 943.7480 957.0022 1009.0353 1032.6350 1054.0693 1111.6216 1151.4949 1166.1127 1191.4805 1205.2957 1211.8760 1241.6590 1253.5080 1308.4998 1316.5687 1326.8220 1332.1578 1356.6539 1375.8589 1398.4072 1411.0709 1430.2200 1441.0199 1461.3039 1464.7652 1468.2615 1513.8666 1541.7536 1564.2487 1580.3806 1594.8481 1609.2135 1626.2929 2979.2685 3076.1496 3132.3857 3138.3992 3141.6589 3149.2120 3165.6424 3168.8609 3502.8836
redmass: 5.7656 8.2435 6.5699 5.7341 4.4892 4.8168 2.7200 4.0677 4.0226 8.1902 1.5530 7.9159 5.1014 6.2211 8.4361 7.7347 3.6304 10.0421 3.5843 5.9325 6.8956 8.4821 5.8943 8.4071 4.5107 8.5080 7.3392 7.2131 4.4122 5.6226 1.2326 6.5553 5.3703 3.5702 1.4035 5.0065 2.1021 7.4854 5.7685 3.8832 1.4560 1.5751 6.1053 1.4557 3.1460 6.1128 2.9692 1.2642 1.4314 2.3779 2.4729 2.6669 2.1697 2.5693 4.6266 6.6446 2.9302 1.6531 2.1197 3.2643 5.9697 3.6371 3.4808 1.2119 2.6903 3.1513 1.1904 1.0485 7.1231 7.9531 7.4754 9.7595 7.4642 7.5507 9.4958 1.0321 1.1046 1.0915 1.0922 1.0902 1.1011 1.0914 1.0975 1.0817
irintensity: 1.8079 1.5270 3.2594 0.2770 0.0976 0.8804 5.6269 8.8973 0.1317 2.1899 0.8982 2.5655 0.0020 1.0893 21.1974 1.1012 3.9841 3.9372 1.5940 3.7800 6.9344 14.3189 1.4860 0.3999 10.1976 4.1835 5.6273 4.9438 10.4650 7.1099 70.1124 2.9304 10.1771 7.9837 79.0122 17.2564 11.5911 12.4752 0.1611 21.7904 3.8753 8.2942 7.3833 0.8945 17.4973 90.0039 101.3911 0.0300 29.3000 17.4142 161.2059 233.2261 84.5847 23.0707 158.5767 32.8231 22.1685 29.7253 6.3166 0.2782 29.8803 175.3164 12.7928 12.2564 112.8656 4.2348 33.8714 18.1450 67.7756 31.4811 32.1112 207.9583 592.4128 1.1415 7.0627 41.1237 29.8680 6.8114 14.9254 10.5086 15.3227 6.7527 15.8220 115.7496
temp: 298.150 k
press: 1.00000 atm
elementType: 8 8 8 7 7 7 6 6 6 6 6 6 6 6 6 6 6 6 6 6 6 1 1 1 1 1 1 1 1 1
symmnumber: 1
zpe: 558543.5 jmol-1
zpe.correction: 0.212738 hartree
zpe.thermalcorrener: 0.228616 hartree
zpe.thermalcorrenthalpy: 0.229561 hartree
zpe.thermalcorrgfe: 0.169320 hartree
zpe.sumelectzpe: -965.488507 hartree
zpe.sumelectthermal: -965.472628 hartree
zpe.sumelectthermalent: -965.471684 hartree
zpe.sumelectthermalfe: -965.531925 hartree
dipole: 1.7542 -5.4074 0.0093
dipole: 5.6848
quadrupole: -110.1812 -126.0262 -120.6037
quadrupole: -12.1188 0.0557 0.0391
quadrupole: 8.7558 -7.0892 -1.6666 -12.1188 0.0557 0.0391
hfenergy: -965.7012446 hartree
pointgroup: C01 [X(C15H9N3O3)]
dipole: 0.6931776 -2.1199687 -0.1658758 debye
polarizability: 374.8435803|21.8291642|202.7601549|-12.7999143|7.0652689|78.3189965 unknown
InChI: InChI=1S/C15H9N3O3/c1-21-11-4-10(19)12-13-8(6-17-14(12)15(11)20)7-5-16-3-2-9(7)18-13/h2-6,18H,1H3
charge 0 multiplicity 1
30 atoms
O  4.925905 0.151359 -0.328719
O  0.918526 -2.572578 -0.310576
O  3.397839 2.341301 -0.119791
N  -1.561193 -1.319504 -0.112734
N  0.581289 2.278992 0.018976
N  -5.30749 0.569164 0.187188
C  -0.707961 -0.225509 -0.081672
C  -1.481641 0.982311 0.03431
C  0.702567 -0.184111 -0.146676
C  -2.877694 0.569503 0.073523
C  -2.88607 -0.86932 -0.020669
C  1.294656 1.111084 -0.091809
C  -0.777662 2.208609 0.08076
C  1.502931 -1.42693 -0.264784
C  2.795061 1.238652 -0.158054
C  -4.120624 1.237818 0.175616
C  -4.101985 -1.579586 -0.01042
C  3.572592 -0.068937 -0.277684
C  2.954766 -1.303565 -0.326188
C  -5.277397 -0.802808 0.095526
C  5.813891 -1.01907 -0.443461
H  -1.193634 -2.273499 -0.19208
H  -1.301659 3.166602 0.169173
H  -4.181868 2.329361 0.250115
H  -4.153167 -2.669677 -0.079668
H  3.511703 -2.241376 -0.411913
H  -6.257166 -1.292639 0.109085
H  6.828939 -0.600801 -0.4654
H  5.606216 -1.573891 -1.377103
H  5.691529 -1.685954 0.430029
