program: Gaussian 09
title: 000148169
version: EM64L-G09RevD.01
frameworkgroup: C1[X(C25H25Cl2N3S)]
method: RPBEPBE
basis: SDD
operation: Freq
keyword: #p
keyword: freq=noraman
keyword: PBEPBE/SDD
title: #p freq=noraman PBEPBE/SDD
converged: YES YES NO NO
title: Mulliken charges:
elementType: Cl Cl S N N N C C C C C C C C C C C C C C C C C C C C C C C C C H H H H H H H H H H H H H H H H H H H H H H H H H
charge: -0.047483 -0.051801 0.158508 -0.184059 -0.392418 -0.049152 0.271650 0.238533 0.254842 -0.318199 -0.098168 -0.104418 0.459974 -0.371368 -0.369701 -0.712872 -0.355657 -0.351957 -0.221524 -0.369635 -0.349809 -0.315257 -0.315135 -0.238471 -0.242584 -0.588785 -0.588641 -0.293998 -0.274716 -0.237085 -0.236048 0.289295 0.242898 0.234196 0.251801 0.241866 0.249076 0.242271 0.269482 0.274416 0.209102 0.233743 0.242823 0.237447 0.265088 0.263969 0.263293 0.252292 0.263195 0.294779 0.265309 0.292098 0.230587 0.226048 0.230823 0.229535
chargesum: 0.00000
title: Mulliken charges with hydrogens summed into heavy atoms:
elementType: Cl Cl S N N N C C C C C C C C C C C C C C C C C C C C C C C C C
charge: -0.047483 -0.051801 0.158508 -0.184059 -0.103123 -0.049152 0.271650 0.238533 0.254842 0.158894 -0.098168 -0.104418 0.459974 0.122299 0.121646 -0.168974 -0.146555 -0.118213 -0.221524 -0.126812 -0.112362 -0.050168 -0.051165 0.024823 0.009708 -0.030811 -0.031234 -0.063412 -0.048667 -0.006261 -0.006514
polarizability: 3.65424490e+02 -2.09197307e+01 3.63002174e+02 -3.77966514e+01 -3.60593241e+01 3.42988313e+02
1716.lowfreq: -5.8441 -1.2090 -0.0010 0.0008 0.0012 2.9446 5.4742 7.9395 17.4110
frequency: 3.0436 7.3256 17.2751 28.1059 32.9996 41.1430 52.0650 54.4212 61.2368 83.8228 91.5926 103.4935 112.9980 119.8737 129.8964 162.5225 193.9671 201.4048 204.5760 214.9975 222.3000 242.0507 256.6867 263.2806 305.7783 322.3272 323.2608 331.8170 338.4321 381.7682 396.4297 411.2513 418.9365 420.2016 436.2385 467.3188 476.4495 508.3808 523.8262 526.6758 550.1576 576.4986 583.9102 586.9872 605.5992 606.1427 630.2242 641.2582 652.7971 682.3658 683.6884 686.0728 711.0367 715.2559 746.6509 759.0741 768.9527 770.0322 778.4043 790.6215 799.9253 805.1496 814.8294 823.9827 853.9750 863.2141 868.2473 876.4137 913.5804 944.3822 951.3062 958.0211 959.9954 964.0775 982.4522 986.0354 990.9518 991.6639 996.3552 1016.1477 1022.6851 1031.0429 1032.4696 1040.1893 1044.3369 1068.9301 1087.3384 1108.1482 1118.0131 1125.7691 1132.5488 1157.9925 1163.5947 1179.1871 1180.9645 1194.3939 1208.4815 1213.9287 1220.4393 1223.7362 1249.8766 1252.3361 1257.3579 1278.5009 1280.6847 1288.0199 1291.2043 1295.7088 1305.4164 1341.0543 1346.4167 1351.5744 1362.4147 1363.5847 1374.7140 1389.4347 1398.9730 1418.7092 1423.7190 1439.2987 1440.9336 1451.8117 1455.9480 1463.3922 1465.6941 1480.6824 1481.2054 1492.1328 1496.3132 1498.7479 1524.9990 1552.3721 1557.4888 1561.2449 1608.1219 1612.3018 1629.1767 2948.1629 3010.4546 3013.2311 3031.8046 3056.3691 3061.0076 3063.9533 3070.6510 3077.1375 3104.8913 3114.1986 3128.9612 3133.7544 3139.2217 3140.2520 3144.1459 3145.2843 3148.4218 3152.1750 3162.1994 3163.1765 3167.9451 3169.2500 3171.0986 3435.5969
redmass: 10.6495 7.7648 7.0059 8.8857 8.9175 9.9926 6.2308 3.5494 5.3258 4.0571 4.7202 4.7059 3.2296 2.8633 3.5557 3.7846 4.8005 5.2319 7.6548 4.3378 3.3094 4.5599 3.7752 3.6833 4.7037 4.1938 5.2955 4.9068 4.3850 5.0150 6.1094 4.2855 3.4790 3.2374 5.1665 3.2722 2.9738 3.3064 4.1918 2.7669 5.3677 3.9016 4.0467 4.2706 4.9660 5.4240 7.1672 5.7703 4.2665 4.4431 4.4589 5.5537 1.7939 2.8910 3.2660 3.7712 1.4037 1.5127 1.1217 1.2314 2.8290 2.4088 1.2927 1.6507 3.1576 4.0671 1.5853 2.0654 5.2465 1.8415 1.7828 1.3684 1.3605 1.3455 2.2332 2.7290 1.3562 1.3247 1.4629 2.1741 2.2638 4.0412 1.9627 1.5467 3.8654 3.8456 2.6459 2.0764 1.5768 2.1689 1.3844 1.1815 1.3773 1.5087 1.2142 1.4155 1.1334 1.3208 2.1136 1.4511 2.6151 1.1563 1.1631 1.6600 1.4132 1.7046 1.8531 1.1999 1.3874 1.6565 1.5968 1.2468 1.8986 4.8314 3.3669 1.5247 3.2406 2.9490 1.1621 3.4587 2.7366 2.9457 1.0957 1.1259 1.8736 1.0856 1.3617 2.1798 1.1516 2.0034 6.4199 6.3774 6.8110 3.2658 6.1428 5.3886 6.4309 1.0707 1.0611 1.0626 1.0598 1.0882 1.0570 1.0563 1.1027 1.1020 1.0876 1.1073 1.0853 1.0879 1.0891 1.0884 1.0890 1.1116 1.1117 1.0940 1.0944 1.0944 1.0951 1.0993 1.0996 1.0735
irintensity: 0.0436 0.2159 0.1826 0.3618 1.6664 0.4876 1.5170 0.0857 0.6062 0.8224 3.5464 1.9950 1.0340 1.0476 2.8882 6.6392 8.7485 1.4581 5.6753 0.1118 0.3449 0.0444 1.4753 3.8454 1.1362 2.1444 2.9249 1.2625 0.3235 13.9967 6.1793 9.1279 4.2725 0.3120 3.5379 0.0596 1.6308 0.2554 20.7593 13.5281 1.7769 0.2947 3.1572 1.5725 3.2315 3.7757 0.8282 9.6505 16.4654 13.3769 88.1557 77.9177 20.4857 9.7429 2.9028 14.3770 1.0655 191.7637 3.7173 11.5002 7.0744 22.7870 7.8514 59.2160 20.1757 1.9895 0.2297 2.4462 16.3024 8.5908 12.7851 2.2123 3.3516 0.0809 12.8814 4.9610 2.5176 0.2502 4.6046 12.0822 2.7780 0.1343 7.4558 0.4786 1.2197 0.6723 4.3637 0.1362 31.5683 46.6251 3.7583 1.7429 3.0692 63.9776 14.5737 5.1191 27.3179 37.1961 25.6361 3.2224 0.3738 13.0000 14.1717 23.9340 39.1571 9.8308 9.7241 4.9084 4.8176 57.1390 99.7694 1.8300 9.0676 0.3438 34.2508 27.7734 20.4689 5.4007 10.3083 62.0617 17.1290 1.0066 6.7095 26.8750 106.1570 6.9032 172.3768 160.2776 79.3610 83.6374 40.9524 87.0897 5.2916 13.4347 222.0477 21.9845 11.1881 52.4641 13.0193 38.0093 11.3122 28.3548 12.3237 23.7878 4.8644 16.4671 5.9690 10.6352 3.8502 10.7189 0.0690 11.6853 13.2316 6.2879 22.1553 19.7558 23.3869 18.7535 11.3732 34.4316 25.2234 97.0400
temp: 298.150 k
press: 1.00000 atm
elementType: 17 17 16 7 7 7 6 6 6 6 6 6 6 6 6 6 6 6 6 6 6 6 6 6 6 6 6 6 6 6 6 1 1 1 1 1 1 1 1 1 1 1 1 1 1 1 1 1 1 1 1 1 1 1 1 1
symmnumber: 1
zpe: 1162565.1 jmol-1
zpe.correction: 0.442798 hartree
zpe.thermalcorrener: 0.471804 hartree
zpe.thermalcorrenthalpy: 0.472748 hartree
zpe.thermalcorrgfe: 0.375997 hartree
zpe.sumelectzpe: -2447.881894 hartree
zpe.sumelectthermal: -2447.852888 hartree
zpe.sumelectthermalent: -2447.851944 hartree
zpe.sumelectthermalfe: -2447.948694 hartree
dipole: 3.6316 -2.5172 0.3906
dipole: 4.4359
quadrupole: -225.3313 -208.6402 -198.4051
quadrupole: 10.6403 -8.2797 -11.5738
quadrupole: -14.5391 2.1520 12.3871 10.6403 -8.2797 -11.5738
hfenergy: -2448.3246919 hartree
pointgroup: C01[X(C25H25Cl2N3S1)]
dipole: 1.3170846 -1.1400013 0.1072451 debye
polarizability: 375.1932915|-6.3730072|380.6465781|-37.2798767|-24.1798688|315.5751078 unknown
InChI: InChI=1S/C25H25Cl2N3S/c26-13-16-30(17-14-27)19-9-11-20(12-10-19)31-18-15-28-25-21-5-1-3-7-23(21)29-24-8-4-2-6-22(24)25/h1-12,28H,13-18H2
charge 0 multiplicity 1
56 atoms
Cl 4.014554 3.83795 2.254882
Cl 7.536695 -2.283282 2.572805
S  0.390816 -2.613072 -2.481641
N  4.965093 0.209628 0.461195
N  -2.193477 -1.402022 -1.049418
N  -4.081721 2.193446 0.394171
C  -2.855711 -0.249553 -0.598033
C  -2.695217 0.99783 -1.304413
C  -3.720867 -0.273184 0.549236
C  -1.320234 -2.235468 -0.187077
C  -3.348748 2.185813 -0.765131
C  -4.267916 0.99212 1.02851
C  3.89321 -0.445099 -0.185632
C  4.908593 1.655062 0.745619
C  6.176092 -0.530665 0.857568
C  -0.636074 -3.320754 -1.026621
C  -1.897418 1.140067 -2.494569
C  -4.132159 -1.484091 1.208323
C  1.740592 -1.763005 -1.554459
C  2.715142 0.265731 -0.575623
C  3.951459 -1.841949 -0.490432
C  -3.200227 3.4379 -1.460531
C  -5.080133 0.991391 2.218091
C  1.663969 -0.383745 -1.251283
C  2.89664 -2.480469 -1.169474
C  4.116919 1.964823 2.032088
C  5.982435 -1.276775 2.192869
C  -1.777463 2.368993 -3.141996
C  -4.950425 -1.451399 2.335326
C  -2.440575 3.530899 -2.622396
C  -5.403943 -0.196332 2.866077
H  -1.771342 -1.312756 -1.982376
H  -0.547266 -1.610579 0.311357
H  -1.897052 -2.728015 0.613554
H  4.458887 2.199655 -0.104368
H  5.937809 2.038285 0.856335
H  6.4683 -1.24944 0.070518
H  7.01341 0.180932 0.960715
H  0.044631 -3.924269 -0.405559
H  -1.373319 -3.979161 -1.51768
H  -1.372187 0.277538 -2.924517
H  -3.84878 -2.448573 0.777124
H  2.604254 1.332628 -0.363245
H  4.823435 -2.442218 -0.215966
H  -3.712502 4.303601 -1.02952
H  -5.446296 1.962382 2.565627
H  0.781887 0.19561 -1.54449
H  2.977723 -3.545991 -1.409977
H  4.61424 1.58416 2.936409
H  3.077577 1.60939 1.984553
H  5.85568 -0.591605 3.043919
H  5.156548 -2.001689 2.154911
H  -1.171119 2.450107 -4.050762
H  -5.269795 -2.386782 2.80798
H  -2.339999 4.490182 -3.141996
H  -6.032426 -0.182276 3.763521
