program: Gaussian 09
title: 000148126
version: EM64L-G09RevD.01
frameworkgroup: C1[X(C24H23ClO3)]
method: RPBEPBE
basis: SDD
operation: Freq
keyword: #p
keyword: freq=noraman
keyword: PBEPBE/SDD
title: #p freq=noraman PBEPBE/SDD
converged: YES YES NO NO
title: Mulliken charges:
elementType: Cl O O O C C C C C C C C C C C C C C C C C C C C C C C C H H H H H H H H H H H H H H H H H H H H H H H
charge: -0.081524 -0.292863 -0.430400 -0.440396 0.166020 0.100859 -0.532855 0.285016 0.291761 0.306217 -0.401495 -0.372968 -0.601968 -0.372422 -0.380490 -0.388646 -0.416784 -0.370743 -0.378957 0.345872 -0.354060 -0.393061 -0.228579 -0.239435 0.272832 -0.247368 -0.274747 -0.337670 0.238363 0.275931 0.233585 0.258239 0.258874 0.290039 0.259396 0.252218 0.254303 0.231968 0.247422 0.248981 0.252452 0.219085 0.226895 0.226375 0.229528 0.203947 0.231870 0.214957 0.205735 0.354627 0.354063
chargesum: 0.00000
title: Mulliken charges with hydrogens summed into heavy atoms:
elementType: Cl O O O C C C C C C C C C C C C C C C C C C C C C C C C
charge: -0.081524 -0.292863 -0.075773 -0.086333 0.166020 0.100859 -0.018561 0.285016 0.291761 0.306217 -0.167910 -0.114730 -0.053055 -0.113026 -0.128271 -0.134343 -0.184816 -0.123321 -0.129976 0.345872 -0.101608 -0.173976 -0.001684 -0.013060 0.272832 -0.017840 0.161070 0.083022
polarizability: 4.06885790e+02 -7.24577858e+00 3.17016154e+02 1.30359604e+01 -1.20446198e+01 1.95019395e+02
1716.lowfreq: -2.7472 -0.0024 -0.0015 0.0004 3.5821 7.4493 20.8932 23.9873 29.7669
frequency: 20.8477 23.9509 29.7531 38.0259 40.1303 50.3354 54.5423 61.5006 63.4589 76.2938 96.5374 114.5261 131.3840 136.6622 154.6726 175.5616 197.1106 207.0430 220.8070 240.2606 278.4937 305.0356 311.6414 327.0182 367.8416 368.6975 395.9450 404.3709 411.8845 413.3719 416.7695 438.2076 450.3477 465.3519 486.5486 517.1442 528.5745 545.6493 584.3537 601.0833 615.2204 623.8547 632.7867 646.2062 665.2062 698.5398 706.0219 728.1742 741.2057 757.0837 769.0553 781.1936 796.1896 807.7279 813.1679 821.9820 838.7745 843.7804 852.1557 875.5925 892.1457 903.7338 923.9890 940.4699 947.2333 966.7080 970.4899 977.7889 983.7481 988.0754 990.8242 994.7670 1003.1372 1004.4263 1021.2384 1046.0007 1050.0303 1058.6475 1085.5639 1088.8322 1104.9827 1116.1641 1134.8866 1143.1884 1172.6317 1175.5442 1182.1156 1185.3935 1190.1983 1193.5220 1215.8798 1226.7151 1245.3876 1249.4916 1259.8714 1275.9085 1289.0879 1305.1801 1311.0031 1321.1036 1326.5549 1332.7082 1355.5129 1367.1134 1369.8438 1377.9811 1385.3560 1416.4743 1423.7156 1431.9191 1453.5398 1454.4619 1459.5255 1475.1560 1481.5518 1494.5286 1499.2020 1568.0255 1572.3135 1583.0304 1590.2522 1605.3427 1615.6232 1619.6562 2966.0395 2974.1849 2994.3828 3038.7442 3057.4554 3082.1342 3087.5613 3111.4890 3121.4202 3128.2670 3137.6954 3140.8492 3141.2402 3142.2462 3144.8016 3148.2927 3151.5692 3164.4415 3165.4473 3168.2051 3172.9608 3554.1719 3581.1954
redmass: 7.4466 7.7732 4.9732 7.1949 6.2263 3.9382 4.5392 6.0931 4.4763 3.8937 3.0849 3.0882 4.5549 5.1124 5.6945 5.6271 5.6493 6.4378 4.6328 4.0501 4.1943 3.1945 4.6154 3.7765 1.1362 3.9081 3.7515 2.8525 2.1719 2.8954 2.9793 1.7123 4.3630 3.2817 4.2290 2.9094 3.0353 4.6075 4.2536 4.6448 6.3919 6.4922 6.9847 5.2427 4.6851 2.8580 2.1463 3.8736 3.1769 2.9079 1.6149 2.4705 2.9791 1.6632 1.9904 1.5242 1.5670 1.7447 1.2555 2.9020 2.5855 4.1980 1.5127 1.3554 1.3738 1.3559 1.3567 1.3908 2.0471 5.7262 2.5073 1.3190 2.5474 2.7154 2.7900 2.8733 3.0811 2.5381 1.6884 1.7464 1.4668 1.3419 1.2966 1.3452 1.0871 1.3552 1.2958 1.9336 1.1928 1.1199 1.2764 2.3970 1.3706 2.1925 2.4996 1.3518 2.2293 1.5029 1.3679 1.5925 1.3240 1.1984 2.9939 1.5907 5.9014 4.4043 1.3020 3.8728 3.4905 2.3195 1.1015 1.1069 1.0865 1.4271 1.5170 2.5109 2.7099 7.2845 6.7452 6.3518 7.2607 6.0703 6.3509 6.3407 1.0556 1.0687 1.0664 1.1061 1.0568 1.0968 1.0935 1.0887 1.0849 1.0870 1.0889 1.0883 1.0924 1.1096 1.0945 1.0891 1.0956 1.0951 1.1014 1.0958 1.0967 1.0656 1.0660
irintensity: 0.1506 0.1059 0.6769 1.7496 0.5202 0.4055 0.2551 0.1470 0.2302 2.8082 0.6647 2.3128 3.5478 1.9021 0.1641 1.3783 5.8085 2.9627 1.3426 4.6294 2.0999 1.9695 0.8080 9.3630 131.4069 2.3207 11.5412 0.7484 81.6799 4.2742 0.5716 139.9685 9.6943 4.4121 11.9860 25.9946 8.6975 13.7692 11.6232 31.2110 0.7824 7.8392 2.0800 12.1615 15.3048 59.6949 8.7699 3.0375 10.0228 10.5000 21.3021 58.9869 11.3793 15.1973 19.9273 1.0285 49.9846 42.9880 0.2281 27.5621 46.0224 3.2546 7.8091 0.9285 1.2071 0.6154 2.4912 1.1351 35.4882 4.8026 92.7503 0.9049 2.4801 5.4962 14.4990 2.1555 48.2331 6.1950 7.5871 11.7593 72.8076 14.2771 7.8334 258.9939 5.1896 146.9527 11.5639 9.0630 14.1549 0.0252 63.0565 205.6733 15.7054 24.3403 26.7390 22.2594 9.5161 1.6480 9.7008 9.9231 11.5180 16.3149 11.7333 27.4109 5.5779 23.8733 24.4172 9.8126 3.3275 8.2457 28.7372 30.6753 7.6837 19.7467 4.1548 93.6994 128.5627 5.5209 8.6354 10.9189 22.9767 13.2665 100.8227 61.1266 33.7057 54.8551 10.8158 44.4150 15.8857 31.3718 5.6916 22.7420 5.9719 0.3215 16.1874 13.6722 18.4116 9.5656 14.9846 3.0355 33.4806 13.8149 26.1416 7.2226 5.0975 6.6756 55.4565
temp: 298.150 k
press: 1.00000 atm
elementType: 17 8 8 8 6 6 6 6 6 6 6 6 6 6 6 6 6 6 6 6 6 6 6 6 6 6 6 6 1 1 1 1 1 1 1 1 1 1 1 1 1 1 1 1 1 1 1 1 1 1 1
symmnumber: 1
zpe: 1061900.7 jmol-1
zpe.correction: 0.404457 hartree
zpe.thermalcorrener: 0.430902 hartree
zpe.thermalcorrenthalpy: 0.431847 hartree
zpe.thermalcorrgfe: 0.344338 hartree
zpe.sumelectzpe: -1612.052752 hartree
zpe.sumelectthermal: -1612.026306 hartree
zpe.sumelectthermalent: -1612.025362 hartree
zpe.sumelectthermalfe: -1612.112870 hartree
dipole: -1.3488 -3.2156 3.2087
dipole: 4.7387
quadrupole: -181.2171 -175.7237 -161.5097
quadrupole: -9.0479 12.2722 -6.8597
quadrupole: -8.4003 -2.9069 11.3071 -9.0479 12.2722 -6.8597
hfenergy: -1612.4572087 hartree
pointgroup: C01 [X(C24H23Cl1O3)]
dipole: 0.6592957 -1.1853382 -1.2790827 debye
polarizability: 404.4873113|13.6554858|317.994445|17.0764835|16.549236|196.4395824 unknown
InChI: InChI=1S/C24H23ClO3/c25-15-14-23(18-4-2-1-3-5-18)24(19-6-10-21(27)11-7-19)20-8-12-22(13-9-20)28-17-16-26/h1-13,26-27H,14-17H2
charge 0 multiplicity 1
51 atoms
Cl -0.915329 5.112299 0.200665
O  -5.123826 -1.103322 -0.086518
O  3.80803 -4.632361 0.027494
O  -7.830137 -0.634282 0.74525
C  1.019094 1.353149 0.322526
C  0.504179 0.076913 0.146501
C  0.135691 2.543099 0.70892
C  -0.968747 -0.190827 0.064645
C  1.37502 -1.143352 0.08928
C  2.476222 1.67346 0.163332
C  -1.817528 0.529282 -0.815749
C  -1.559898 -1.224252 0.849477
C  0.126604 3.632379 -0.372833
C  2.452758 -1.33449 1.000907
C  1.110303 -2.179374 -0.846975
C  3.201253 1.207518 -0.970697
C  3.160334 2.50554 1.093917
C  -3.201949 0.263986 -0.901877
C  -2.935917 -1.497396 0.78497
C  -3.764607 -0.749712 -0.089157
C  3.246479 -2.49406 0.969089
C  1.904502 -3.343535 -0.900459
C  4.55757 1.544316 -1.157172
C  4.520966 2.837534 0.91298
C  2.977354 -3.49873 0.010486
C  5.228066 2.358814 -0.213828
C  -6.04894 -0.334241 -0.945531
C  -7.438619 -0.890847 -0.641278
H  0.523729 2.997496 1.641505
H  -0.895006 2.217557 0.918581
H  -1.385088 1.296717 -1.467005
H  -0.926552 -1.810161 1.52405
H  -0.342481 3.300714 -1.31116
H  1.127083 4.044041 -0.568518
H  2.662508 -0.564573 1.749972
H  0.273854 -2.069768 -1.545908
H  2.688243 0.58104 -1.707857
H  2.634424 2.882276 1.978902
H  -3.816848 0.839648 -1.599597
H  -3.38887 -2.282181 1.398653
H  4.069128 -2.641926 1.67471
H  1.685632 -4.124298 -1.640886
H  5.09174 1.17459 -2.039725
H  5.02788 3.469266 1.651206
H  6.282466 2.619656 -0.357415
H  -5.783246 -0.473384 -2.01358
H  -5.993781 0.740319 -0.681143
H  -8.191698 -0.3781 -1.26306
H  -7.460609 -1.976557 -0.871551
H  3.536333 -5.279759 -0.669652
H  -7.115969 -0.999422 1.32871
