program: Gaussian 09
title: 000148043
version: EM64L-G09RevD.01
frameworkgroup: C1[X(C15H12O7)]
method: RPBEPBE
basis: SDD
operation: Freq
keyword: #pfreq=noraman
keyword: PBEPBE/SDD
title: #p freq=noraman PBEPBE/SDD
converged: YES YES NO NO
title: Mulliken charges:
elementType: O O O O O O O C C C C C C C C C C C C C C C H H H H H H H H H H H H
charge: -0.237747 -0.388609 -0.392336 -0.370939 -0.248602 -0.347392 -0.351175 0.240202 0.444452 0.063850 0.175768 -0.072771 -0.334089 -0.155578 -0.491934 0.350331 -0.011589 0.173668 0.274943 -0.508490 -0.774883 -0.487716 0.272663 0.284539 0.285827 0.247366 0.240501 0.247108 0.386733 0.364382 0.398742 0.232831 0.247691 0.242254
chargesum: 0.00000
title: Mulliken charges with hydrogens summed into heavy atoms:
elementType: O O O O O O O C C C C C C C C C C C C C C C
charge: -0.237747 -0.001876 -0.027955 0.027803 -0.248602 -0.347392 -0.351175 0.240202 0.444452 0.063850 0.175768 -0.072771 -0.061426 -0.155578 -0.207395 0.350331 -0.011589 0.173668 0.274943 -0.222663 -0.039908 0.235060
polarizability: 3.84136607e+02 1.35869572e+01 2.36149943e+02 3.38135365e+00 -3.49910043e+00 9.09425045e+01
1716.lowfreq: -10.6885 -0.0007 0.0005 0.0006 0.2958 3.8095 31.5954 49.6691 66.9049
frequency: 31.5896 49.6580 66.9042 103.6298 124.1188 127.5111 138.2642 140.6770 157.6431 189.9405 195.3983 205.0949 234.2172 238.7017 275.4751 311.3288 317.9963 336.5791 349.0537 361.9293 388.4773 398.1337 404.5037 428.3905 436.6994 447.2934 475.0513 494.7036 519.9198 545.8092 576.5725 602.9303 634.1873 655.5721 669.5009 707.2209 718.3176 741.6020 753.0366 779.8313 810.9955 837.6852 869.9343 876.7704 885.4658 905.1501 955.3069 991.8348 996.3495 997.4055 1014.4765 1046.8011 1047.6258 1100.9779 1104.5009 1131.3897 1158.3951 1174.2594 1194.6196 1217.9431 1245.6714 1253.2214 1302.6611 1311.1076 1319.8579 1334.4348 1367.7656 1386.9213 1398.3001 1402.2778 1423.1890 1430.6122 1441.2297 1449.8037 1452.7425 1454.4098 1462.9988 1466.3231 1512.6064 1533.2502 1575.0929 1599.2398 1617.4209 1635.1805 2290.2538 2498.3242 2987.3317 3012.3348 3066.2173 3072.8053 3115.1084 3126.7206 3138.9027 3180.7271 3199.3308 3550.0475
redmass: 3.4647 4.7379 5.6830 4.6931 4.3623 2.1334 2.2608 3.1556 5.8615 2.5159 1.8225 4.5111 4.9736 5.7524 4.8719 3.9754 4.5011 1.3375 3.8031 5.9152 6.1647 9.0773 7.4736 7.4063 9.1491 9.4137 7.1803 8.7188 6.5661 6.1417 6.1871 5.1387 6.2078 6.8793 7.4698 5.7863 5.6775 6.4166 7.8894 6.2747 3.9805 5.1630 1.7843 1.5431 5.2186 6.5124 6.5064 3.6348 3.8274 1.1546 1.8270 1.5249 1.0660 3.3253 1.2394 2.2493 1.9872 1.8599 2.2368 1.3919 2.1144 3.6544 2.4800 3.0700 2.1486 2.6760 2.1835 3.4850 1.3373 3.0281 3.5865 5.5190 1.2708 1.0465 1.0773 1.0666 4.4786 1.2369 5.2132 4.6671 3.6925 3.2874 3.9973 7.2590 1.0824 1.0770 1.0375 1.0280 1.0970 1.0880 1.0990 1.1052 1.1066 1.0919 1.0929 1.0663
irintensity: 7.1030 0.4838 0.4302 0.9516 5.7550 0.4746 3.0587 1.4879 1.2791 3.2279 0.5289 1.4656 0.2882 2.9518 3.0436 17.6287 4.8426 70.3059 7.4220 3.3692 18.8417 0.2651 6.0213 2.9033 1.8190 36.9649 3.0374 2.9161 7.3523 18.6420 20.4282 3.7716 5.7495 15.2688 32.6416 1.8880 5.5366 5.1741 5.6778 31.8492 24.8131 10.8229 18.6513 31.9633 56.5211 136.8739 43.7939 46.7634 23.0125 170.2108 36.7873 9.9963 130.9418 15.3696 0.1001 20.9865 18.3251 20.0641 267.3070 39.2720 24.0393 325.7927 130.0544 292.8828 45.4505 71.1760 35.9877 62.5900 43.1890 200.7867 246.7019 99.6955 4.8732 16.4803 69.5334 25.8126 81.0275 36.4127 41.5144 533.6947 42.6307 9.8198 212.9685 253.5539 115.5568 60.8824 22.8779 51.2464 9.3660 9.7305 11.8757 24.4242 36.4002 2.1344 5.7491 18.0513
temp: 298.150 k
press: 1.00000 atm
elementType: 8 8 8 8 8 8 8 6 6 6 6 6 6 6 6 6 6 6 6 6 6 6 1 1 1 1 1 1 1 1 1 1 1 1
symmnumber: 1
zpe: 635610.5 jmol-1
zpe.correction: 0.242091 hartree
zpe.thermalcorrener: 0.261334 hartree
zpe.thermalcorrenthalpy: 0.262279 hartree
zpe.thermalcorrgfe: 0.195068 hartree
zpe.sumelectzpe: -1103.791084 hartree
zpe.sumelectthermal: -1103.771841 hartree
zpe.sumelectthermalent: -1103.770896 hartree
zpe.sumelectthermalfe: -1103.838107 hartree
dipole: -1.5301 -3.0374 -0.1766
dipole: 3.4056
quadrupole: -96.6317 -132.3868 -128.8628
quadrupole: -8.7280 1.1919 2.1792
quadrupole: 22.6621 -13.0931 -9.5690 -8.7280 1.1919 2.1792
hfenergy: -1104.033175 hartree
pointgroup: C01 [X(C15H12O7)]
dipole: -0.6096417 -1.1863766 0.1267957 debye
polarizability: 383.6782688|14.8454081|229.958043|12.1038114|-28.8703786|97.5927436 unknown
InChI: InChI=1S/C15H12O7/c1-5-3-6-9(15(20)22-5)14(19)10-7(16)4-8(21-2)13(18)11(10)12(6)17/h3-4,15,17,19-20H,1-2H3
charge 0 multiplicity 1
34 atoms
O  -4.076098 0.169706 -0.611437
O  -0.799509 2.85942 -0.718432
O  -3.424403 1.70064 1.119571
O  0.034359 -2.4780 0.689785
O  4.780606 -0.240769 0.274288
O  2.498985 -2.071071 0.680395
O  1.668754 3.217917 -0.748733
C  -1.687759 0.683828 -0.150564
C  -1.493794 -0.676697 0.175864
C  0.748889 1.068773 -0.203838
C  0.968442 -0.291186 0.171213
C  -0.579386 1.558659 -0.36333
C  -3.090847 1.222149 -0.203627
C  -0.144037 -1.167969 0.352651
C  -2.633247 -1.562202 0.273385
C  -3.873125 -1.135418 -0.146038
C  2.316225 -0.816135 0.351146
C  1.878212 1.964402 -0.406504
C  3.455015 0.120579 0.142819
C  3.216173 1.441153 -0.221619
C  -5.120532 -1.963452 -0.236179
C  5.226431 -1.577007 0.737509
H  -3.22131 2.00512 -0.968908
H  -2.485323 -2.592395 0.59852
H  4.061907 2.117239 -0.373991
H  -5.890468 -1.583195 0.460767
H  -4.910081 -3.016808 0.00605
H  -5.547695 -1.908198 -1.254251
H  0.173815 3.299311 -0.809665
H  -4.18822 2.33138 1.067181
H  1.075711 -2.623755 0.768899
H  6.322354 -1.483192 0.767384
H  4.914126 -2.362825 0.033036
H  4.822532 -1.803001 1.736953
