program: Gaussian 09
title: 000148025
version: EM64L-G09RevD.01
frameworkgroup: C1[X(C7H12N2O3S)]
method: RPBEPBE
basis: SDD
operation: Freq
keyword: #p
keyword: freq=noraman
keyword: PBEPBE/SDD
title: #p freq=noraman PBEPBE/SDD
converged: YES YES NO NO
title: Mulliken charges:
elementType: S O O O N N C C C C C C C H H H H H H H H H H H H
charge: 0.026367 -0.167949 -0.268812 -0.304955 -0.401464 -0.591208 -0.147883 -0.340703 0.218509 0.244676 -0.767976 -0.120709 -0.719918 0.281478 0.207647 0.299647 0.359826 0.251505 0.254081 0.226861 0.322662 0.349512 0.272452 0.242378 0.273973
chargesum: 0.00000
title: Mulliken charges with hydrogens summed into heavy atoms:
elementType: S O O O N N C C C C C C C
charge: 0.026367 -0.167949 -0.268812 -0.304955 -0.041638 0.080967 0.133595 0.166592 0.218509 0.244676 -0.035528 -0.120709 0.068884
polarizability: 1.17236474e+02 -2.92029607e+00 1.18269271e+02 -1.34261806e+01 1.54921857e-01 1.09126807e+02
1716.lowfreq: -13.3630 -8.7118 -5.5313 -0.0016 -0.0013 0.0023 18.0011 29.0522 45.4587
frequency: 17.1141 28.9130 45.4431 55.3071 66.1571 82.0362 103.6048 152.7078 189.8510 195.5972 231.1866 289.5389 343.7278 356.0835 377.1104 435.0440 466.3186 471.5294 479.2750 521.3806 555.4647 591.6006 604.2163 637.6631 679.4317 719.5797 745.9751 812.9092 856.7532 928.1388 953.6417 971.7914 997.4920 1008.4277 1043.8466 1051.1667 1068.9240 1144.0158 1181.1387 1201.0060 1229.7876 1247.1518 1281.2783 1296.7545 1347.2709 1378.5106 1383.5278 1390.0599 1449.9985 1453.5524 1462.2562 1462.8986 1488.1895 1490.6126 1588.5486 1601.2663 1657.6479 2954.7657 2975.5558 3000.2923 3014.2033 3052.5531 3097.0029 3107.7543 3108.5594 3137.9039 3443.7972 3524.8187 3672.9273
redmass: 5.1511 5.0816 3.7023 1.4105 3.2770 6.1921 4.0511 4.3094 4.3022 1.2004 4.6649 7.9089 3.2584 3.1705 2.6432 4.0317 2.1166 3.2845 2.0899 1.8159 3.7584 2.7215 3.0807 1.9254 3.7405 1.1515 3.6687 4.6446 3.2746 2.9849 3.3283 2.3975 1.6424 1.5179 1.6655 1.8670 2.0260 2.1109 3.1928 1.6146 4.6079 1.3743 1.9328 1.5260 1.2834 2.9513 1.2523 1.2373 1.0464 1.0752 1.1276 1.0734 1.9975 1.1413 4.2051 1.7297 3.0282 1.0809 1.0407 1.0358 1.0639 1.0959 1.0977 1.1015 1.1005 1.0963 1.0781 1.0455 1.1038
irintensity: 3.9897 1.2213 4.1935 0.4954 1.8456 24.7021 0.8934 27.4904 0.3861 1.2574 1.0223 1.3053 4.2144 1.3254 0.6613 6.7423 12.3594 0.2828 23.3289 113.5550 68.7086 1.8208 13.2609 113.8849 25.4936 116.1720 6.9162 1.1380 5.8110 14.6127 21.1375 127.9713 11.8527 1.0722 12.9909 10.3022 4.2581 65.5444 123.3477 109.7853 154.3445 45.6872 15.1104 33.9075 6.0870 185.0479 5.6988 80.5088 16.4856 2.1196 84.9541 29.0915 233.0025 75.9517 217.6071 36.8136 236.1734 16.9699 4.7194 6.6204 60.3600 6.0777 7.8855 15.8485 4.5400 3.3234 126.8381 45.6614 35.9821
temp: 298.150 k
press: 1.00000 atm
elementType: 16 8 8 8 7 7 6 6 6 6 6 6 6 1 1 1 1 1 1 1 1 1 1 1 1
symmnumber: 1
zpe: 508177.0 jmol-1
zpe.correction: 0.193554 hartree
zpe.thermalcorrener: 0.208735 hartree
zpe.thermalcorrenthalpy: 0.209679 hartree
zpe.thermalcorrgfe: 0.148100 hartree
zpe.sumelectzpe: -1006.180441 hartree
zpe.sumelectthermal: -1006.165261 hartree
zpe.sumelectthermalent: -1006.164316 hartree
zpe.sumelectthermalfe: -1006.225896 hartree
dipole: 2.5242 1.2634 -3.1771
dipole: 4.2499
quadrupole: -96.9428 -74.7181 -84.4473
quadrupole: 6.0562 6.1003 -15.7600
quadrupole: -11.5734 10.6513 0.9221 6.0562 6.1003 -15.7600
hfenergy: -1006.3739957 hartree
pointgroup: C01 [X(C7H12N2O3S1)]
dipole: -0.8265395 0.7170068 1.2642825 debye
dipolederiv: -0.6163095 0.0736107 0.2677049 0.0219478 -0.281857 0.042314 0.3886062 -0.0281018 -0.4239397 -1.1324698 0.4050709 0.3781133 0.8696462 -0.7472873 -0.3968319 0.3958592 -0.1627995 -0.4576848 -0.4359858 -0.121018 -0.1725598 -0.0051171 -0.7246705 0.0743025 -0.3260093 -0.1223162 -0.8911943 -0.5681232 -0.0939528 -0.06448 -0.1517961 -0.6966857 0.0531597 -0.0261569 0.3012379 -0.892465 -0.6089154 -0.2290152 0.0241317 -0.2922731 -1.1515609 0.1080008 0.012479 0.2817588 -0.4275203 -0.6666371 -0.0733787 0.0046204 -0.1146312 -1.0165163 -0.4533651 -0.0020112 -0.3059808 -0.4728506 0.3581842 0.0584225 0.0179442 0.0998032 0.1580084 0.1632165 0.0640459 0.3963367 0.0423551 0.6006954 -0.2277965 -0.1521375 -0.0936544 0.1250778 0.1098086 -0.2516263 0.1516238 0.3614464 0.3834146 0.3267227 0.296279 0.1352091 1.3598223 0.2152558 0.4438476 0.1724994 1.0865118 0.4430649 0.4102887 0.0996846 0.5394012 1.3770203 -0.148514 0.1170131 -0.3289552 1.0344232 -0.0511448 -0.110425 -0.103625 -0.1447641 -0.2143499 -0.1948097 -0.1083247 -0.1745372 -0.1291928 1.1365649 -0.3257648 -0.7632982 -0.8509202 0.8789043 0.2107859 -0.8169232 -0.0439752 0.5637308 -0.0591832 -0.0789279 0.1495246 0.0541914 -0.2827551 0.1279289 0.1324988 0.209139 -0.0665182 -0.046161 0.0511038 0.0793878 0.0081117 0.0062001 -0.0232682 0.0169226 -0.1088479 -0.007894 -0.0508772 -0.031911 0.0128293 0.000808 -0.0597966 -0.1708352 0.0649596 -0.1569845 -0.0477166 0.0888309 0.0847575 0.0425008 0.0468906 0.0092765 0.0902364 0.061949 0.0213485 0.0591414 0.2877084 -0.0295815 -0.0211582 0.0003842 0.4079798 0.0125703 -0.0508031 -0.1610067 0.1890524 0.0598563 0.1210192 0.0072109 0.0836194 -0.0108913 -0.0132083 -0.0305908 -0.0033375 0.0834586 -0.0567441 -0.0721856 0.0219374 -0.0408352 0.1117728 0.0059084 0.0576488 0.000341 0.0739015 0.1094828 -0.0201315 0.0067777 -0.0056784 0.034238 0.1110628 -0.0300327 0.0454548 -0.0909426 0.3292429 -0.0640133 -0.0889195 -0.0655164 0.2822836 0.0689281 -0.0751823 0.052547 0.163536 0.3374456 -0.0690571 -0.054019 -0.0437023 0.2420994 0.0287112 -0.0564513 0.0157704 0.1834521 0.0394041 0.0972493 0.033023 0.0553142 0.0364652 -0.0163184 0.0628492 -0.0616501 0.0959196 0.1212144 -0.0214984 -0.0081651 -0.0537849 0.0654217 -0.0420324 -0.0057591 -0.0070452 -0.0975638 -0.0025582 -0.059588 -0.0133071 -0.0526535 0.0918005 0.0369933 -0.038808 0.0174806 0.0685537 unknown
polarizability: 117.0706048|2.5127251|117.3359226|-13.7001914|1.9053093|110.2260247 unknown
InChI: InChI=1S/C7H12N2O3S/c1-4(10)9-6(7(8)11)3-12-5(2)13/h6,9H,3,8H2,1-2H3
charge 0 multiplicity 1
25 atoms
S  3.600809 -0.395883 -1.048431
O  1.644738 0.580591 0.423738
O  -1.071114 2.251931 -1.441264
O  -1.537375 -1.738052 1.309427
N  -1.230956 -0.12487 -0.327538
N  -0.244402 3.339984 0.430159
C  -0.800553 0.917081 0.604025
C  0.499019 0.553765 1.361884
C  -0.70245 2.225981 -0.229565
C  -1.620039 -1.380683 0.086477
C  -2.138663 -2.310141 -1.002408
C  2.393186 -0.554832 0.114267
C  2.097854 -1.836907 0.866088
H  -1.574582 1.057446 1.390547
H  0.72494 1.306391 2.139637
H  0.356884 -0.426804 1.840505
H  -1.337424 0.198471 -1.298772
H  -1.515109 -3.220365 -1.034564
H  -3.163534 -2.62807 -0.744177
H  -2.147012 -1.84737 -2.003318
H  0.132636 3.303255 1.374957
H  -0.152099 4.206312 -0.100414
H  2.759566 -2.628153 0.489426
H  2.282925 -1.715066 1.951917
H  1.047156 -2.164113 0.751897
