program: Gaussian 09
title: 000148000
version: EM64L-G09RevD.01
frameworkgroup: C1[X(C5H7Br2F2NO2S)]
method: RPBEPBE
basis: SDD
operation: Freq
keyword: #p
keyword: freq=noraman
keyword: PBEPBE/SDD
title: #p freq=noraman PBEPBE/SDD
converged: YES YES NO NO
title: Mulliken charges:
elementType: Br Br S F F O O N C C C C C H H H H H H H
charge: 0.124173 0.125532 0.285967 -0.145796 -0.159514 -0.430777 -0.215050 -0.626151 -0.102536 -0.685822 0.136032 -0.756962 0.211185 0.282083 0.298782 0.294826 0.372071 0.316810 0.287227 0.387918
chargesum: 0.00000
title: Mulliken charges with hydrogens summed into heavy atoms:
elementType: Br Br S F F O O N C C C C C
charge: 0.124173 0.125532 0.285967 -0.145796 -0.159514 -0.042858 -0.215050 -0.022114 0.179548 -0.092214 0.136032 -0.384890 0.211185
polarizability: 1.52272055e+02 1.00647434e+01 1.23738509e+02 2.10691778e+00 4.26984506e+00 8.18213214e+01
1716.lowfreq: -10.3014 -1.0594 -0.0018 -0.0013 -0.0012 8.8616 18.3844 26.3981 44.7108
frequency: 17.0485 26.3312 44.6819 47.0598 62.5031 95.1868 119.0269 157.7532 176.7888 194.6020 228.4360 251.3866 272.0235 275.8969 299.8152 350.6508 381.6071 398.8824 478.4777 509.4710 528.2559 597.4554 612.9282 628.3866 641.1873 667.6693 708.9729 718.6317 763.2188 877.8553 901.1683 917.9717 1015.9345 1054.8532 1101.5158 1108.6510 1147.0523 1162.0923 1206.6721 1232.4825 1250.3660 1272.6781 1313.6949 1382.0642 1428.5351 1637.3547 1670.8810 2893.4571 3062.4811 3133.1152 3143.4186 3479.9726 3519.6856 3610.5528
redmass: 9.3614 10.4572 6.1669 13.9814 15.1291 11.0044 12.8445 18.4412 10.4142 20.7790 3.9856 1.3371 8.4520 3.4265 3.0136 12.9472 6.2495 8.6899 3.8608 9.5869 4.5389 1.3730 6.4662 1.7340 7.8094 2.5509 8.0329 4.0108 2.8271 5.4328 4.4421 2.5902 3.9681 2.0529 4.2958 2.6450 1.0745 1.1649 1.6194 1.2640 1.1705 1.7222 1.3057 1.9618 1.0892 1.0925 9.2884 1.0801 1.0584 1.0872 1.1078 1.0450 1.0642 1.0991
irintensity: 1.5694 1.3577 0.8078 2.2934 1.2360 1.1461 0.5956 0.3130 0.1864 0.3838 4.6978 43.7271 1.9767 1.0490 5.8767 7.5478 36.3431 5.9547 54.7585 3.4965 7.4842 10.1125 66.8255 356.9507 56.2792 109.2177 67.2975 4.0610 14.9169 119.2692 76.7800 42.5896 86.3720 238.4515 74.9212 2.1960 18.4434 5.5789 4.8827 1.0016 9.2682 27.9877 7.5059 16.6803 19.4343 62.9060 180.7155 29.9198 4.1743 2.8606 0.6366 9.7765 34.7100 12.1192
temp: 298.150 k
press: 1.00000 atm
elementType: 35 35 16 9 9 8 8 7 6 6 6 6 6 1 1 1 1 1 1 1
symmnumber: 1
zpe: 327650.2 jmol-1
zpe.correction: 0.124795 hartree
zpe.thermalcorrener: 0.140578 hartree
zpe.thermalcorrenthalpy: 0.141522 hartree
zpe.thermalcorrgfe: 0.077055 hartree
zpe.sumelectzpe: -1023.552154 hartree
zpe.sumelectthermal: -1023.536371 hartree
zpe.sumelectthermalent: -1023.535427 hartree
zpe.sumelectthermalfe: -1023.599895 hartree
dipole: 2.3413 -0.4098 -0.9802
dipole: 2.5710
quadrupole: -87.1087 -100.8180 -101.7336
quadrupole: -1.0215 -10.8560 -0.7515
quadrupole: 9.4447 -4.2646 -5.1802 -1.0215 -10.8560 -0.7515
hfenergy: -1023.6769495 hartree
pointgroup: C01 [X(C5H7Br2F2N1O2S1)]
dipole: -0.9478612 -0.0562692 0.3486598 debye
dipolederiv: -0.455884 0.2214379 -0.1906789 0.1900641 -0.1928233 0.1347154 -0.2866184 0.1983609 -0.1573902 -0.1198901 0.022108 -0.0178633 0.0899459 -0.5887213 0.0983527 -0.0296421 0.0155746 -0.0131177 -0.4336961 -0.0121629 -0.0269266 -0.132777 -0.0232065 -0.0499005 0.0015411 -0.0664399 -0.0943246 -0.4371465 -0.0089342 0.0906502 0.0271721 -0.2505331 -0.0136143 -0.0698111 -0.0712376 -0.8073862 -0.4980896 -0.0403879 -0.0332265 0.2140745 -0.826236 -0.0386233 -0.0701501 0.0243369 -0.2793434 -1.0223153 0.1635158 0.4146797 0.2844165 -0.4347417 -0.2570152 0.4392034 -0.1968866 -0.585142 -0.6362354 0.18299 0.0043648 0.0916562 -0.4506628 0.250943 0.288886 0.0869999 -0.8097888 -0.726389 -0.2423927 0.0621214 -0.2567881 -0.5735796 -0.0814549 0.1627216 -0.0914496 -0.5471366 0.321514 0.3120459 -0.0726771 0.0762805 0.236338 0.0725185 -0.3783504 0.0044746 0.2259984 0.4482617 0.103065 -0.0899886 0.3895284 0.0909872 -0.02395 -0.1231525 0.0377794 0.0242759 1.1835172 0.1469746 0.0639214 -0.2784467 0.7981704 0.106302 0.2446013 0.073083 1.0143202 0.480709 -0.4398474 0.3379198 -0.2696688 0.9698888 -0.2445325 0.3391367 -0.2620406 0.1842156 1.1979466 -0.4684519 -0.3705046 -0.5220496 0.5643245 -0.1558869 -0.5810946 -0.1090387 1.1344823 -0.0226442 -0.1048639 -0.0316224 -0.0652924 -0.0950805 -0.0225357 -0.0607161 -0.0536033 -0.0026789 0.010814 0.0291961 0.0078164 -0.0004499 0.003533 0.0378797 0.0249033 0.0715403 0.0660365 -0.0191962 -0.0572175 -0.0568873 -0.0572076 0.0958091 -0.0189246 0.0454116 -0.0321669 0.0109742 0.0122673 0.0227961 -0.0884336 0.0253489 -0.0484554 -0.0023707 -0.042355 0.0257177 0.0091176 0.223984 0.0592599 0.0625647 0.0783561 0.2353592 -0.011978 0.2187855 0.0530312 0.20738 0.1406682 0.0583464 -0.0478503 0.0493493 0.2327448 0.1048357 -0.0536935 0.1508663 0.1888265 0.3518042 0.0525227 -0.017379 0.0664875 0.2568851 0.1152396 -0.0696066 0.1410984 0.2306812 unknown
polarizability: 151.5971065|-6.577363|116.2937698|10.3231573|-16.518145|89.9410097 unknown
InChI: InChI=1S/C5H7Br2F2NO2S/c6-4(7)5(8,9)13-1-2(10)3(11)12/h2,4,11H,1,10H2
charge 0 multiplicity 1
20 atoms
Br 4.367974 -0.39605 1.010938
Br 2.891668 2.344142 -0.102853
S  0.253975 0.326678 -1.077307
F  1.195469 -0.078913 1.463399
F  1.727387 -1.711652 -0.021156
O  -3.98324 1.221055 0.705229
O  -2.77384 1.334536 -1.27388
N  -2.914203 -1.282518 1.099522
C  -2.062081 -0.232017 0.519522
C  -1.12279 -0.867943 -0.526563
C  1.581461 -0.276611 0.093082
C  2.956495 0.346784 -0.201028
C  -2.937885 0.834231 -0.143197
H  -1.437649 0.308747 1.271598
H  -0.633604 -1.765375 -0.11821
H  -1.667322 -1.137045 -1.443761
H  3.267189 0.09365 -1.22359
H  -3.797539 -0.941461 1.48811
H  -2.417425 -1.924135 1.722717
H  -4.529438 1.926497 0.264027
