program: Gaussian 09
title: 000147986
version: EM64L-G09RevD.01
frameworkgroup: C1[X(C10H16N2O)]
method: RPBEPBE
basis: SDD
operation: Freq
keyword: #p
keyword: freq=noraman
keyword: PBEPBE/SDD
title: #p freq=noraman PBEPBE/SDD
converged: YES YES NO NO
title: Mulliken charges:
elementType: O N N C C C C C C C C C C H H H H H H H H H H H H H H H H
charge: -0.311146 -0.692965 -0.716397 -0.388383 -0.342087 -0.273196 0.258884 -0.686995 0.263485 -0.541089 0.548103 -0.361879 -0.449583 0.207298 0.207504 0.194052 0.192996 0.198432 0.198411 0.212041 0.211795 0.217115 0.232169 0.209710 0.208139 0.323648 0.290389 0.296576 0.292976
chargesum: 0.00000
title: Mulliken charges with hydrogens summed into heavy atoms:
elementType: O N N C C C C C C C C C C
charge: -0.311146 -0.078929 -0.126846 0.026419 0.044960 0.123647 0.258884 -0.046044 0.263485 -0.308920 0.548103 -0.152169 -0.241444
polarizability: 1.73039724e+02 9.17769412e+00 1.48756408e+02 2.76967325e-01 -1.17354260e-01 7.19258097e+01
1716.lowfreq: -14.5556 -9.0071 -3.7976 -0.0006 0.0008 0.0008 35.1359 45.3926 63.5037
frequency: 34.9122 44.6821 63.4955 100.1892 133.4566 142.2557 178.7771 184.2664 186.6396 230.6123 237.2762 240.5684 276.4392 322.7207 350.8325 358.0507 405.1476 423.5946 446.1770 466.8200 532.0448 584.4232 602.6712 709.5972 722.6613 741.4409 782.7798 796.5290 807.9902 824.0676 891.5263 898.2103 929.1731 939.5948 986.2693 1015.1016 1040.4712 1045.4692 1083.6054 1123.2285 1136.5290 1147.4851 1163.1658 1212.7466 1262.9628 1272.2094 1276.6390 1284.6698 1301.0411 1334.0611 1347.4341 1379.9955 1392.1651 1402.2866 1449.0994 1468.6062 1473.1215 1478.5926 1483.5283 1491.0382 1532.6556 1595.5867 1606.5626 1633.1206 1656.8413 2938.4180 2966.0736 2975.3665 2990.2580 2992.8988 3009.5858 3055.1138 3073.6226 3075.4416 3113.5280 3136.5076 3141.6204 3577.4079 3579.3052 3720.1649 3726.6071
redmass: 4.0709 1.6071 3.8353 3.0819 1.9442 4.9735 1.2423 3.3890 1.1848 3.9427 1.1654 3.3835 1.0443 3.1004 5.8450 3.3601 1.2186 3.1057 1.9902 5.8952 3.3014 7.3631 3.2309 2.7318 6.5822 1.0785 1.5089 4.8405 1.3985 1.4166 1.3709 2.0850 2.8563 1.1462 3.9892 1.6910 2.1462 1.7796 2.1961 2.5283 1.8026 1.4553 1.7298 1.3708 1.7535 1.3641 1.1605 1.0821 1.4581 3.3340 1.6961 1.5804 1.2452 4.8182 4.1452 1.0747 1.0764 1.0422 1.0740 1.0940 3.6225 6.5886 1.2249 1.1715 5.4861 1.0548 1.0588 1.0362 1.0592 1.1054 1.1010 1.1045 1.1012 1.0995 1.0865 1.0935 1.0931 1.0437 1.0446 1.1041 1.1047
irintensity: 0.2368 0.0097 0.0371 2.4392 0.0052 1.3550 77.3785 4.4952 439.9000 0.6592 1.8995 34.3884 22.9166 10.2030 3.0025 4.8754 55.6172 1.5540 2.8998 0.4064 3.1634 4.1701 18.6769 0.1859 3.6577 10.3272 33.9269 19.0879 27.2388 33.4425 0.0244 12.8975 13.8542 0.3517 42.1153 16.0060 1.9688 24.5221 8.2134 21.3980 208.8652 1.5678 76.9452 0.0079 55.7003 9.1477 0.6571 0.0875 24.7337 82.5310 12.2383 13.9964 3.8444 14.1180 9.2075 0.9666 0.0892 12.9263 15.7477 25.0159 368.3940 39.6591 169.5099 154.2892 16.0184 34.1557 32.7097 35.0278 40.4485 29.8225 4.1069 28.3748 98.2268 49.8003 24.7405 42.5804 5.4817 109.8601 2.3350 15.5683 31.3708
temp: 298.150 k
press: 1.00000 atm
elementType: 8 7 7 6 6 6 6 6 6 6 6 6 6 1 1 1 1 1 1 1 1 1 1 1 1 1 1 1 1
symmnumber: 1
zpe: 644415.3 jmol-1
zpe.correction: 0.245445 hartree
zpe.thermalcorrener: 0.260576 hartree
zpe.thermalcorrenthalpy: 0.261520 hartree
zpe.thermalcorrgfe: 0.202939 hartree
zpe.sumelectzpe: -574.384155 hartree
zpe.sumelectthermal: -574.369024 hartree
zpe.sumelectthermalent: -574.368080 hartree
zpe.sumelectthermalfe: -574.426660 hartree
dipole: 1.0487 -1.3736 0.0374
dipole: 1.7286
quadrupole: -68.3263 -63.2040 -85.0491
quadrupole: 1.6140 -0.0493 -0.0483
quadrupole: 3.8668 8.9892 -12.8560 1.6140 -0.0493 -0.0483
hfenergy: -574.6295998 hartree
pointgroup: C01 [X(C10H16N2O1)]
dipole: 0.3859492 0.5587204 0.0370828 debye
polarizability: 173.8719653|-7.938089|147.3421479|-0.5808158|6.6303448|72.5078286 unknown
InChI: InChI=1S/C10H16N2O/c1-2-3-6-13-10-7-8(11)4-5-9(10)12/h4-5,7H,2-3,6,11-12H2,1H3
charge 0 multiplicity 1
29 atoms
O  0.794547 -0.677204 0.022834
N  -0.80211 -2.822378 -0.156855
N  -3.12092 2.348372 0.294784
C  3.145299 -0.109426 0.082828
C  4.217038 0.996243 0.226419
C  1.723382 0.455228 0.135206
C  -0.594141 -0.400468 0.050454
C  5.65394 0.435595 0.161315
C  -1.413713 -1.566642 -0.049212
C  -1.150219 0.888589 0.163924
C  -2.564846 1.060452 0.181325
C  -2.815783 -1.377295 -0.029637
C  -3.388875 -0.089585 0.08292
H  3.285353 -0.646744 -0.875035
H  3.264426 -0.855751 0.89208
H  4.071154 1.528808 1.188308
H  4.079262 1.751805 -0.574031
H  1.544277 0.989025 1.093004
H  1.547826 1.165287 -0.700971
H  5.830703 -0.296576 0.971357
H  5.834507 -0.078996 -0.801042
H  6.40559 1.239651 0.261685
H  -0.502594 1.768629 0.239692
H  -3.472626 -2.252967 -0.103349
H  -4.480234 0.017614 0.094254
H  0.211553 -2.873928 -0.168554
H  -1.355668 -3.667315 -0.241517
H  -4.127343 2.47568 0.304448
H  -2.529385 3.1701 0.356566
