program: Gaussian 09
title: 000009832
version: EM64L-G09RevD.01
frameworkgroup: C1[X(C8H7ClFNO)]
method: RPBEPBE
basis: SDD
operation: Freq
keyword: #p
keyword: freq=noraman
keyword: PBEPBE/SDD
title: #p freq=noraman PBEPBE/SDD
converged: NO YES NO NO
title: Mulliken charges:
elementType: Cl F O N C C C C C C C C H H H H H H H
charge: -0.054499 -0.202501 -0.215369 -0.456199 0.503980 -0.428811 -0.326028 -0.182876 -0.196361 -0.120644 0.179092 -0.307484 0.224599 0.312723 0.304041 0.256953 0.257778 0.225369 0.226237
chargesum: 0.00000
title: Mulliken charges with hydrogens summed into heavy atoms:
elementType: Cl F O N C C C C C C C C
charge: -0.054499 -0.202501 -0.215369 -0.152157 0.503980 -0.204212 -0.013305 0.074077 0.061416 -0.120644 0.179092 0.144122
polarizability: 1.77755362e+02 -1.15343009e+00 1.02601381e+02 -3.12623187e-02 -1.27079816e-02 4.54948227e+01
1716.lowfreq: -54.3842 -7.2143 -0.0035 -0.0031 -0.0029 3.3643 14.7983 48.1955 65.0596
frequency: -54.2925 48.1787 65.0570 101.6850 141.3240 222.6893 248.8603 303.8781 325.0430 357.5915 411.4108 425.4676 497.9294 559.9937 611.8220 618.7093 641.8067 699.9744 704.1634 814.3324 814.3942 847.8288 918.1384 937.7110 982.0191 993.4079 1001.0724 1029.6320 1074.5728 1117.6643 1157.7392 1184.6657 1187.3899 1258.2913 1295.8944 1336.6662 1367.7251 1400.4617 1450.5207 1479.1699 1507.0421 1596.6285 1606.2403 1651.3670 2981.9303 3047.3848 3119.5069 3166.4633 3171.9559 3198.6266 3504.6291
redmass: 2.8211 8.6376 5.3374 10.5469 6.2142 8.8594 10.8258 10.1978 5.1458 5.5234 3.0026 9.8395 2.7250 3.3056 1.2118 7.0981 7.7545 5.9045 3.5055 1.3966 5.7753 1.4066 7.2367 1.3579 1.3190 4.2897 1.9393 7.4979 2.6793 1.3419 3.0652 1.0714 1.1141 2.1114 1.3447 1.4483 4.2782 4.1858 1.0768 2.3875 2.1700 5.4647 6.2468 6.1685 1.0547 1.1080 1.0902 1.0914 1.0952 1.0955 1.0761
irintensity: 5.7594 0.0105 8.8761 4.7372 0.4323 0.2492 0.0951 6.2384 0.3088 0.2985 0.0032 21.8261 49.0785 0.0156 58.8159 0.1514 1.9117 22.9352 0.7434 40.5574 14.1464 62.9740 12.2196 1.1380 3.2621 24.1117 0.2420 84.4975 39.6815 17.9382 43.7322 0.0526 3.8595 38.1715 23.0685 38.1680 78.0769 15.2959 7.1889 122.6968 371.4658 30.0271 10.3590 160.3903 24.7678 21.0284 15.2990 2.1485 2.2185 6.7661 11.5486
temp: 298.150 k
press: 1.00000 atm
elementType: 17 9 8 7 6 6 6 6 6 6 6 6 1 1 1 1 1 1 1
symmnumber: 1
zpe: 354014.8 jmol-1
zpe.correction: 0.134837 hartree
zpe.thermalcorrener: 0.145172 hartree
zpe.thermalcorrenthalpy: 0.146117 hartree
zpe.thermalcorrgfe: 0.097419 hartree
zpe.sumelectzpe: -998.058923 hartree
zpe.sumelectthermal: -998.048588 hartree
zpe.sumelectthermalent: -998.047643 hartree
zpe.sumelectthermalfe: -998.096341 hartree
dipole: -0.1091 5.3289 0.0162
dipole: 5.3301
quadrupole: -93.7479 -68.3449 -77.7765
quadrupole: -14.5349 -0.0802 -0.0048
quadrupole: -13.7914 11.6115 2.1799 -14.5349 -0.0802 -0.0048
hfenergy: -998.1937601 hartree
pointgroup: C01 [X(C8H7Cl1F1N1O1)]
dipole: 0.0298104 -2.0967907 -0.0061763 debye
dipolederiv: -0.9049218 -0.1256453 0.0001408 -0.1516929 -0.1480744 0.000062 0.000206 0.000071 -0.0663992 -0.6935313 0.1362844 0.0019923 0.2587072 -0.3113027 -0.0015106 0.0042031 -0.0011595 -0.2459355 -0.6452165 -0.068823 -0.0004092 0.5767243 -0.8707167 -0.0002858 -0.0020548 0.0002417 -0.3199271 -1.8219526 0.191301 -0.0008056 0.3912895 -0.3577656 0.0001239 -0.0001376 -0.0002563 -0.3252963 1.1735673 0.0903457 -0.0001795 0.3443225 -0.0004808 0.0001344 -0.000548 0.0000653 0.0981989 -0.1938736 -0.0224802 -0.0000388 0.0865465 0.0664877 -0.0001272 -0.0000135 -0.0002055 -0.2024969 -0.1749054 -0.0014653 -0.0001146 -0.1267192 -0.0396471 -0.0001055 -0.0002119 -0.0000491 -0.1562292 -0.2108001 -0.0436137 0.0000125 -0.151029 0.0244442 -0.0000701 0.0001196 -0.0000458 -0.0920959 -0.2435269 -0.0275809 0.0000314 0.0292202 0.0728095 -0.0000707 0.0000191 -0.0000592 -0.0932626 1.1980004 0.2158761 -0.0002882 0.2443759 0.0739324 -0.0001217 -0.0003409 -0.000126 -0.0852747 1.6240931 -0.1455316 0.0023135 -0.9975108 1.1138151 0.0001301 0.0054822 0.0002476 0.1627698 0.5263777 -0.2466517 -0.0026451 -0.4653925 0.2794799 0.0000387 -0.0072299 -0.0007165 0.4213958 0.0212006 -0.1033909 0.0000968 -0.0850427 -0.0730373 0.0001383 0.0000336 0.0001662 0.1694179 0.1416313 0.0541369 0.0000289 0.0186393 0.0849056 0.0000594 0.0000728 0.000035 0.1839815 0.1551039 0.0124662 0.0000585 -0.0416288 0.0893208 0.0002457 0.0001942 0.0004991 0.3063882 0.0269461 0.0737803 -0.0000288 0.0706041 0.0236506 0.000082 -0.0000153 0.0000772 0.1661078 0.0726187 -0.0457993 0.0000416 -0.0507331 -0.0159273 0.0001041 0.0000833 0.0000894 0.1612529 -0.0245721 0.0291711 -0.0101385 0.0246555 -0.0079815 0.0829461 -0.0017939 0.1175352 -0.0398157 -0.0262388 0.0276201 0.0099319 0.024664 -0.0039121 -0.081773 0.001932 -0.1164099 -0.0427797 unknown
polarizability: 177.585039|3.7553193|102.7717087|0.0025673|-0.0181857|45.4948183 unknown
InChI: InChI=1S/C8H7ClFNO/c9-6-1-3-7(4-2-6)11-8(12)5-10/h1-4,11H,5H2
charge 0 multiplicity 1
19 atoms
Cl 4.731523 0.517886 -0.000706
F  -4.743258 0.222361 0.00683
O  -2.255164 1.358685 -0.000366
N  -1.197159 -0.746281 0.000867
C  0.184888 -0.392794 0.00053
C  1.131229 -1.452979 0.00106
C  0.638657 0.953814 -0.000331
C  2.514043 -1.18312 0.000695
C  2.023947 1.222685 -0.000739
C  2.944173 0.158117 -0.000231
C  -2.306119 0.102575 -0.000245
C  -3.63481 -0.68955 -0.003626
H  0.792687 -2.497061 0.001734
H  -0.086631 1.768844 -0.000512
H  -1.384347 -1.753266 0.002064
H  3.239919 -2.00109 0.001099
H  2.377827 2.257705 -0.001374
H  -3.708377 -1.328463 0.8984
H  -3.712429 -1.312567 -0.91635
