program: Gaussian 09
title: 000147959
version: EM64L-G09RevD.01
frameworkgroup: C1[X(C17H22N4O3)]
method: RPBEPBE
basis: SDD
operation: Freq
keyword: #p
keyword: freq=noraman
keyword: PBEPBE/SDD
title: #p freq=noraman PBEPBE/SDD
converged: YES YES NO NO
title: Mulliken charges:
elementType: O O O N N N N C C C C C C C C C C C C C C C C C H H H H H H H H H H H H H H H H H H H H H H
charge: -0.436136 -0.436180 -0.315648 -0.145014 -0.122694 -0.133778 -0.673001 -0.447785 -0.447423 0.455402 -0.320664 -0.320680 -0.350642 -0.334801 -0.379346 -0.326688 0.152637 0.168097 0.230590 -0.481614 0.311786 -0.305670 -0.346001 -0.527778 0.222539 0.259635 0.222811 0.259341 0.194444 0.246805 0.194741 0.246756 0.220529 0.217842 0.241694 0.266227 0.332875 0.332893 0.256421 0.270032 0.217096 0.303980 0.338276 0.225587 0.236791 0.225720
chargesum: 0.00000
title: Mulliken charges with hydrogens summed into heavy atoms:
elementType: O O O N N N N C C C C C C C C C C C C C C C C C
charge: -0.103260 -0.103287 -0.315648 -0.145014 -0.122694 -0.133778 -0.030745 0.034390 0.034728 0.455402 0.120585 0.120817 -0.130113 -0.116960 -0.137653 -0.060461 0.152637 0.168097 0.230590 -0.225194 0.311786 -0.035639 -0.128905 0.160320
polarizability: 6.68965128e+02 -1.34709620e+01 2.20491687e+02 -3.02484640e+00 2.10183430e+01 1.20926103e+02
1716.lowfreq: -5.3420 -3.3319 -0.0008 -0.0005 0.0007 1.8436 16.0776 22.0030 31.1670
frequency: 16.0067 21.9592 30.5990 35.9806 47.9499 76.2687 81.9410 91.3689 102.9416 121.6030 126.4854 154.5597 160.7522 167.5979 181.0560 225.8076 231.0259 256.9785 273.5393 279.6963 292.7574 313.0541 319.7259 350.0535 358.7788 377.9021 392.6705 401.4628 428.8024 444.1140 452.3822 464.5249 480.5902 503.8004 506.0448 524.7713 527.3776 547.8224 562.0873 600.6758 620.0825 633.4270 682.4909 733.0006 740.9611 748.8199 798.2525 804.6908 816.7772 821.0172 825.7447 841.5106 872.6023 879.5226 901.1041 906.5443 922.3631 955.7277 959.6691 975.0614 986.2239 990.9884 1002.3401 1002.7635 1022.4941 1031.2351 1036.8938 1043.1745 1112.7258 1116.9904 1123.8618 1145.0804 1156.2470 1156.7924 1169.5194 1178.7420 1193.4880 1208.9305 1244.3776 1248.7213 1271.6592 1275.8139 1305.3022 1323.0315 1328.5094 1329.9247 1333.3377 1358.9469 1365.6806 1367.0295 1374.3994 1374.8913 1395.4529 1398.6202 1435.2695 1447.3434 1451.0372 1458.9057 1460.3138 1463.0676 1474.5553 1476.2954 1487.3864 1505.2652 1517.5203 1552.0917 1576.0752 1602.0292 1619.5429 1630.9822 2954.7707 2955.5144 2961.3558 2994.1916 2999.9606 3048.0815 3048.8461 3052.1062 3095.2611 3096.1455 3120.1609 3121.2383 3140.5886 3141.0999 3162.5862 3164.7743 3166.9866 3170.1045 3554.5438 3554.8593 3557.9533 3707.2836
redmass: 4.2556 6.1070 5.7598 5.6921 5.9620 4.6536 4.8071 3.2611 5.1278 3.3121 2.5478 4.8743 4.3979 3.6887 4.0839 1.4801 3.6589 3.4748 1.5899 2.2876 3.1256 1.3589 3.2099 3.6699 3.3099 1.4240 2.3882 4.0311 3.4194 5.5280 3.0230 2.9983 3.0832 1.0845 3.8294 2.4909 2.3059 3.8167 3.0040 4.9076 3.7724 6.9266 4.8706 3.8293 3.7503 5.6625 4.1790 1.3143 3.0542 1.5143 1.6800 2.9914 1.5243 6.8215 2.6142 2.0374 5.0678 1.3476 1.3472 1.3359 2.7218 1.8395 2.8235 2.9667 1.6100 1.5539 2.5568 3.6044 1.7918 1.2602 1.4006 1.3484 1.3034 1.4429 1.5089 1.4348 1.9954 3.3244 1.3840 2.5582 1.4972 1.3714 1.5083 1.3125 2.6450 1.7170 2.9470 1.2880 1.8820 1.5870 1.3291 1.3710 4.3780 2.1061 1.5398 3.2630 2.8442 1.0795 1.0959 1.0497 1.1493 1.0736 1.1341 2.8630 3.7256 6.6180 7.4335 1.7316 5.3820 2.6643 1.0685 1.0687 1.0325 1.0614 1.0617 1.1014 1.1040 1.1022 1.0958 1.0957 1.0895 1.1000 1.0865 1.0867 1.0949 1.0905 1.0956 1.0938 1.0663 1.0663 1.0443 1.1045
irintensity: 0.0613 1.1182 2.2467 1.3067 1.6693 1.3850 4.0006 8.0208 5.7198 12.0820 20.8804 1.3078 4.9600 2.6182 4.7759 1.0235 6.5975 20.5447 121.4920 139.1287 7.3918 101.9860 4.5958 16.5172 22.5581 171.6798 47.6919 16.8845 2.2974 32.7277 0.7492 8.1936 10.8766 102.2720 3.8846 23.9373 26.9090 27.9214 16.1223 6.5184 16.3947 1.2264 3.5975 0.2288 6.9075 10.6082 22.0633 0.7597 0.0719 5.7043 85.3779 26.5822 42.7660 11.3149 142.3656 11.3718 5.3591 1.7606 2.3521 3.4390 3.4719 66.8757 78.5740 41.8147 2.9141 79.9902 2.7221 20.0183 52.8658 0.1980 29.2137 79.1637 22.1334 81.4523 29.5407 0.0892 26.6272 264.4414 360.3235 27.2958 11.1011 9.3317 4.3017 22.3771 32.7125 7.1725 302.6839 2.1663 2.1484 17.7911 113.4318 70.1913 14.8800 95.7933 0.2350 5.8952 5.9377 2.6773 8.7985 13.2542 28.8001 64.3196 4.7215 120.5898 311.5216 57.2856 77.6105 3.9643 886.8854 360.5642 108.3983 26.4229 58.6253 69.9926 76.9805 16.4854 47.1409 3.6538 22.7968 45.0851 37.8965 36.1137 28.1927 2.1701 23.0543 8.7591 33.4667 5.4675 5.4193 9.2205 291.0245 36.1811
temp: 298.150 k
press: 1.00000 atm
elementType: 8 8 8 7 7 7 7 6 6 6 6 6 6 6 6 6 6 6 6 6 6 6 6 6 1 1 1 1 1 1 1 1 1 1 1 1 1 1 1 1 1 1 1 1 1 1
symmnumber: 1
zpe: 974197.9 jmol-1
zpe.correction: 0.371052 hartree
zpe.thermalcorrener: 0.395407 hartree
zpe.thermalcorrenthalpy: 0.396351 hartree
zpe.thermalcorrgfe: 0.314734 hartree
zpe.sumelectzpe: -1103.821439 hartree
zpe.sumelectthermal: -1103.797084 hartree
zpe.sumelectthermalent: -1103.796140 hartree
zpe.sumelectthermalfe: -1103.877758 hartree
dipole: -1.6780 1.5685 0.3228
dipole: 2.3195
quadrupole: -68.6041 -120.1629 -157.5803
quadrupole: -0.1640 0.6337 11.5770
quadrupole: 46.8450 -4.7138 -42.1312 -0.1640 0.6337 11.5770
hfenergy: -1104.1924913 hartree
pointgroup: C01 [X(C17H22N4O3)]
dipole: 0.6559252 -0.5588526 0.3003555 debye
polarizability: 668.3664619|-21.8532253|198.850248|-4.6889916|-46.1952987|143.1662083 unknown
InChI: InChI=1S/C17H22N4O3/c1-24-17-12-14(4-7-16(17)18)20-19-13-2-5-15(6-3-13)21(8-10-22)9-11-23/h2-7,12,22-23H,8-11,18H2,1H3
charge 0 multiplicity 1
46 atoms
O  6.378821 -2.484984 -0.82865
O  6.959741 1.533008 1.104996
O  -6.587745 -1.076371 1.018242
N  4.519844 -0.098407 0.003954
N  -1.067007 0.962465 -0.420394
N  -1.910328 0.105982 0.122712
N  -7.4720 1.057847 -0.308135
C  5.05888 -1.171745 0.855809
C  5.485455 0.714378 -0.75438
C  3.140545 0.143288 -0.082095
C  5.254576 -2.520932 0.128185
C  6.037332 1.930962 0.022229
C  2.623436 1.314707 -0.727407
C  2.184361 -0.777278 0.470933
C  1.241772 1.538663 -0.81666
C  0.807805 -0.540714 0.385498
C  0.303718 0.624865 -0.264382
C  -3.283153 0.43675 -0.041308
C  -5.580658 -0.252322 0.465144
C  -4.201729 -0.473547 0.561705
C  -6.097078 0.885078 -0.23911
C  -3.785726 1.569732 -0.742266
C  -5.169416 1.784724 -0.836678
C  -6.147554 -2.260477 1.753884
H  4.387572 -1.318592 1.721772
H  6.023512 -0.824948 1.272337
H  5.009176 1.063621 -1.689042
H  6.319421 0.055893 -1.063685
H  5.401235 -3.331624 0.874865
H  4.372317 -2.758468 -0.487095
H  6.538786 2.629785 -0.682272
H  5.220763 2.464954 0.533408
H  3.300728 2.066564 -1.141914
H  2.523764 -1.700078 0.951357
H  0.853207 2.437746 -1.307428
H  0.089152 -1.252941 0.803428
H  7.227806 -2.484957 -0.317503
H  7.813008 1.235476 0.698089
H  -3.783215 -1.333993 1.092237
H  -3.07012 2.258877 -1.199779
H  -5.555413 2.657385 -1.378225
H  -7.878344 1.849402 -0.796555
H  -8.074507 0.374064 0.143138
H  -5.573821 -2.945787 1.100219
H  -7.069347 -2.754907 2.095021
H  -5.527073 -1.979241 2.6269
