program: Gaussian 09
title: 000147950
version: EM64L-G09RevD.01
frameworkgroup: C1[X(C16H19N3O)]
method: RPBEPBE
basis: SDD
operation: Freq
keyword: #p
keyword: freq=noraman
keyword: PBEPBE/SDD
title: #p freq=noraman PBEPBE/SDD
converged: YES YES NO NO
title: Mulliken charges:
elementType: O N N N C C C C C C C C C C C C C C C C H H H H H H H H H H H H H H H H H H H
charge: -0.314435 -0.664521 -0.103290 -0.145439 -0.388257 -0.341772 -0.271514 0.268055 -0.686463 0.284731 -0.407844 0.131444 -0.366019 -0.345852 0.184511 -0.306018 -0.351164 -0.203218 -0.206431 -0.245395 0.207327 0.207344 0.196895 0.196894 0.210009 0.209913 0.211542 0.211572 0.220017 0.296139 0.223467 0.247453 0.342829 0.308468 0.271758 0.242939 0.223263 0.225152 0.225911
chargesum: 0.00000
title: Mulliken charges with hydrogens summed into heavy atoms:
elementType: O N N N C C C C C C C C C C C C C C C C
charge: -0.314435 -0.013224 -0.103290 -0.145439 0.026414 0.052017 0.148408 0.268055 -0.043332 0.284731 -0.111705 0.131444 -0.142552 -0.098400 0.184511 -0.034260 -0.108225 0.020045 0.018721 -0.019484
polarizability: 4.21101881e+02 -8.95001029e+01 2.66338244e+02 3.61894850e-01 5.21014941e-01 9.55449229e+01
1716.lowfreq: -6.3765 -0.6758 -0.0004 0.0005 0.0008 3.5922 21.4689 35.8431 40.5688
frequency: 21.3968 35.7467 40.5596 47.3225 61.9394 81.7068 99.7429 115.1006 143.6246 153.6162 198.6914 217.1297 227.2759 230.4488 238.0154 286.7631 289.7681 361.3674 388.7415 403.6962 408.3474 421.0060 461.4516 485.1882 494.6419 515.5228 530.5489 557.7410 575.1807 609.5604 625.7277 637.0833 694.1184 739.9368 743.6949 751.9836 778.9630 803.5423 811.3988 816.5938 851.2435 862.3923 900.5399 900.9215 933.6824 942.5709 944.0319 950.6473 983.2162 984.4690 989.5446 997.3539 1013.8470 1022.3713 1043.1086 1072.6032 1087.2048 1118.3846 1125.5918 1141.7256 1148.3358 1155.6413 1167.5966 1189.1897 1214.2571 1231.7261 1274.8376 1277.8255 1279.1204 1289.6259 1302.2496 1328.7596 1337.1828 1348.8415 1379.7033 1386.6167 1389.6562 1404.5751 1441.6892 1455.4459 1465.4288 1470.9892 1473.9229 1476.6193 1482.5518 1491.5613 1516.0189 1572.8082 1581.2600 1600.6195 1602.9073 1630.4204 2954.3861 2969.5628 2975.8229 2989.8936 3009.5758 3014.8909 3056.1118 3074.2633 3077.0736 3122.9465 3132.1760 3133.6864 3148.9063 3162.1234 3166.8537 3168.3720 3169.4381 3550.7995 3700.8321
redmass: 3.7515 4.5008 4.0720 3.3361 1.8701 4.5287 3.3692 3.9492 2.0985 4.2828 5.5580 4.5811 1.1325 4.1042 6.3545 5.1140 5.7532 3.3114 1.8917 3.2925 2.8361 2.2447 2.7117 6.5651 5.7653 3.2352 1.0744 4.2563 7.4058 6.5412 3.9183 6.9534 1.8330 3.4429 1.0996 7.4221 1.7777 4.8940 1.1703 1.4352 1.2467 6.3971 1.4292 1.9160 1.4453 1.1754 1.3448 4.6623 1.3633 6.1538 3.7466 1.3178 2.0733 1.5855 3.1799 1.4955 2.2092 2.1276 2.1533 1.6076 1.4644 1.4966 1.0597 2.3775 1.3562 2.8033 1.3250 1.1594 1.6282 1.0775 1.4390 2.9118 6.0642 1.5104 1.4861 7.3182 1.2428 4.4128 2.4416 4.7938 2.5202 1.0789 1.0726 1.0424 1.0884 1.1101 3.4942 5.9366 6.1802 5.2505 2.0075 2.3779 1.0556 1.0586 1.0368 1.0588 1.1027 1.1041 1.1050 1.1015 1.0995 1.0847 1.0889 1.0887 1.0930 1.0963 1.0942 1.0924 1.0983 1.0445 1.1044
irintensity: 0.1779 0.3653 0.0004 1.4017 1.7709 1.7067 0.8940 0.3159 5.2079 1.2536 0.6437 2.4439 0.1456 0.2357 0.1458 0.3156 0.0343 5.3414 104.2462 0.1912 3.7784 61.0963 11.3150 32.7438 4.8141 6.5711 115.3990 7.0683 14.0424 0.2032 14.9157 0.1376 56.2229 6.9827 6.9866 4.5371 42.4237 10.5976 4.7813 43.6254 0.0370 0.0048 28.1325 13.8503 9.0782 0.1205 1.6897 4.8912 0.0001 0.2790 61.7174 1.0271 10.6994 7.1671 18.5486 18.8801 9.4783 104.0263 30.7906 8.7876 1.7314 43.1573 0.6591 149.2833 0.0044 194.8220 4.5829 0.2822 0.5911 0.1408 6.5895 307.1849 204.8668 14.2217 16.1265 2.7091 9.0458 3.0252 10.3042 6.7557 7.6223 2.9075 1.0666 13.2223 25.2822 37.4658 238.5138 12.4962 2.5115 4.3097 1.9276 589.8909 11.7888 24.0670 34.2304 42.8399 18.4762 0.1172 25.2334 101.9478 42.5565 4.4985 24.1803 12.6627 30.6569 27.2798 12.9500 20.9284 21.6674 243.6221 43.6262
temp: 298.150 k
press: 1.00000 atm
elementType: 8 7 7 7 6 6 6 6 6 6 6 6 6 6 6 6 6 6 6 6 1 1 1 1 1 1 1 1 1 1 1 1 1 1 1 1 1 1 1
symmnumber: 1
zpe: 836883.7 jmol-1
zpe.correction: 0.318752 hartree
zpe.thermalcorrener: 0.338158 hartree
zpe.thermalcorrenthalpy: 0.339102 hartree
zpe.thermalcorrgfe: 0.268741 hartree
zpe.sumelectzpe: -859.086565 hartree
zpe.sumelectthermal: -859.067159 hartree
zpe.sumelectthermalent: -859.066215 hartree
zpe.sumelectthermalfe: -859.136576 hartree
dipole: -4.2425 0.1942 0.0056
dipole: 4.2470
quadrupole: -97.5418 -96.8204 -125.2714
quadrupole: -6.4943 0.0670 0.0898
quadrupole: 9.0028 9.7241 -18.7269 -6.4943 0.0670 0.0898
hfenergy: -859.4053169 hartree
pointgroup: C01 [X(C16H19N3O1)]
dipole: 1.6672869 -0.0986418 0.0480619 debye
polarizability: 418.3816125|-91.3914476|268.6713865|9.9371441|-6.3362379|95.9320489 unknown
InChI: InChI=1S/C16H19N3O/c1-2-3-11-20-16-12-14(9-10-15(16)17)19-18-13-7-5-4-6-8-13/h4-10,12H,2-3,11,17H2,1H3
charge 0 multiplicity 1
39 atoms
O  3.299553 -0.533816 0.173167
N  3.580511 -3.17036 0.234442
N  -1.67432 -1.109453 0.063896
N  -1.817218 0.198914 0.027501
C  4.635852 1.489937 0.177996
C  4.655872 3.036624 0.152838
C  3.209368 0.93861 0.147256
C  2.09053 -1.25795 0.158622
C  6.090212 3.606418 0.183097
C  2.284851 -2.686406 0.193499
C  0.811569 -0.703082 0.115701
C  -0.333117 -1.562762 0.106501
C  1.138925 -3.526312 0.184343
C  -0.151544 -2.970599 0.141709
C  -3.179083 0.641486 -0.014296
C  -4.319122 -0.214058 -0.010793
C  -3.359317 2.050087 -0.061741
C  -5.610586 0.344141 -0.054516
C  -4.657096 2.601467 -0.105881
C  -5.788014 1.750988 -0.102386
H  5.196585 1.09343 -0.690572
H  5.147011 1.123346 1.089198
H  4.084315 3.427417 1.019051
H  4.133149 3.398022 -0.755908
H  2.626535 1.282467 1.026728
H  2.676614 1.254307 -0.773546
H  6.625725 3.284618 1.095905
H  6.674111 3.258063 -0.689399
H  6.083979 4.711327 0.166499
H  0.632317 0.37534 0.088397
H  1.271744 -4.613953 0.2109
H  -1.042566 -3.60609 0.134201
H  4.350173 -2.504604 0.23762
H  3.770367 -4.167568 0.259839
H  -4.160717 -1.296212 0.02604
H  -2.466951 2.685289 -0.063278
H  -6.487898 -0.313361 -0.051626
H  -4.787929 3.688785 -0.142614
H  -6.797389 2.176405 -0.13629
