program: Gaussian 09
title: 000147936
version: EM64L-G09RevD.01
frameworkgroup: C1[X(C16H22N8)]
method: RPBEPBE
basis: SDD
operation: Freq
keyword: #pfreq=noraman
keyword: PBEPBE/SDD
title: #p freq=noraman PBEPBE/SDD
converged: YES YES NO NO
title: Mulliken charges:
elementType: N N N N N N N N C C C C C C C C C C C C C C C C H H H H H H H H H H H H H H H H H H H H H H
charge: -0.401110 -0.444462 -0.701809 -0.694564 -0.660535 -0.658996 -0.387313 -0.385037 -0.407595 -0.409180 0.277462 0.280205 0.245519 0.260562 -0.353416 -0.344608 -0.534711 -0.538317 0.418729 0.416364 -0.425036 -0.432393 0.052145 0.055313 0.201695 0.227962 0.212768 0.227896 0.310229 0.295221 0.233208 0.233682 0.273455 0.277700 0.207328 0.212661 0.304349 0.297068 0.306535 0.300774 0.307047 0.312254 0.308373 0.313731 0.203343 0.205502
chargesum: 0.00000
title: Mulliken charges with hydrogens summed into heavy atoms:
elementType: N N N N N N N N C C C C C C C C C C C C C C C C
charge: -0.090881 -0.149241 -0.100392 -0.087254 -0.041233 -0.036892 -0.183970 -0.179534 0.022063 0.031484 0.277462 0.280205 0.245519 0.260562 -0.120208 -0.110926 -0.261256 -0.260617 0.418729 0.416364 -0.217709 -0.219732 0.052145 0.055313
polarizability: 4.16043685e+02 -1.61604518e-01 2.36070998e+02 3.54104625e+01 -3.18786873e+00 1.39992509e+02
1716.lowfreq: -9.5706 -4.4571 -1.7063 -0.0010 -0.0004 0.0003 11.8568 15.5792 24.0268
frequency: 11.7386 15.5721 24.0117 54.7519 55.7562 64.7954 70.4753 96.5588 120.1454 141.4122 159.1841 194.5957 199.4193 203.4629 211.8964 242.6999 297.9921 302.8846 310.9509 320.5948 335.8537 340.9868 360.5742 369.9435 407.9042 411.8764 416.2323 425.0884 429.3881 442.6585 446.0155 449.5455 487.6590 522.0306 527.4794 532.3520 551.4115 555.7807 561.7911 566.2519 581.6141 586.7856 600.4443 640.5983 680.8819 689.7820 696.1000 698.5643 715.2889 743.6278 745.9464 794.3198 795.9321 804.0336 805.8584 810.5041 820.9744 904.0086 908.7533 910.5952 913.1764 914.2646 924.7151 935.7042 947.2445 1029.9297 1030.8094 1055.9617 1058.2929 1079.3805 1080.2264 1084.3308 1113.4027 1117.8514 1120.1847 1128.6038 1159.8999 1167.6754 1212.9916 1227.2969 1246.1337 1265.0486 1286.4685 1288.0307 1316.9078 1320.5411 1354.2445 1356.8981 1365.2139 1366.6509 1404.7537 1407.6764 1448.9723 1457.7733 1459.0074 1460.5305 1480.2023 1494.5611 1522.9318 1529.3172 1577.7550 1579.6153 1600.0978 1602.2950 1618.0794 1619.6146 1629.7628 1630.9827 1643.3760 1646.6974 2878.1862 2927.2494 3008.8579 3035.7841 3123.0480 3127.1396 3143.9719 3144.2698 3153.0764 3155.3099 3317.3696 3320.4575 3433.9180 3442.7982 3493.8434 3498.9819 3536.1815 3537.0515 3634.5341 3640.9488 3682.5959 3683.5230
redmass: 5.8194 5.2236 4.5287 5.3141 5.1041 4.5332 4.6189 5.5586 4.5408 2.6969 4.9563 3.9128 4.3709 3.5767 3.8312 2.1391 3.0680 4.3570 3.2871 3.1174 1.8135 2.3840 3.5255 1.3764 1.3919 1.7610 1.3584 1.1167 1.1032 4.1819 2.9406 3.0330 4.2155 2.7886 3.5439 3.0633 1.8464 2.8483 2.1975 3.4287 1.8003 3.6669 3.3060 1.4427 2.7255 3.7884 3.1265 4.0926 1.6393 3.7281 3.3242 1.6360 1.5835 2.0700 1.4879 1.3981 2.0067 1.7676 1.3993 1.5119 1.4736 1.7933 2.6065 3.6911 2.6877 1.8552 1.8427 1.4381 1.4458 1.8016 1.6937 1.9597 1.9595 1.7257 1.7344 2.2192 1.4591 1.5618 1.2066 1.4039 2.2945 1.6819 1.4927 1.4381 2.3203 2.0181 1.4713 1.4882 3.8849 4.0098 4.1075 4.3794 1.5884 2.4227 2.2249 4.6736 1.0964 1.1244 3.5583 3.8861 5.4123 5.2064 3.3089 3.0499 2.9033 2.5610 1.4000 1.4331 1.5240 1.5726 1.0712 1.0690 1.0883 1.0924 1.0871 1.0871 1.0916 1.0915 1.0947 1.0950 1.0758 1.0759 1.0746 1.0750 1.0466 1.0465 1.0448 1.0448 1.0990 1.0995 1.1035 1.1035
irintensity: 0.0074 0.2702 0.0136 5.9143 7.7237 1.8517 9.8577 1.2092 2.5855 3.4258 6.5123 10.9108 12.6897 5.5851 2.2026 15.4545 2.8709 1.7091 32.6988 6.8900 45.8178 17.3759 3.2059 5.6181 266.4457 12.5879 255.7845 0.2521 12.0915 14.9696 44.1901 6.1055 35.7928 11.9735 43.8905 3.1702 126.9374 41.9788 81.1161 41.4457 177.4197 12.9862 30.3324 21.2726 69.5270 21.4032 13.4001 3.1460 353.1797 8.9327 75.7926 3.9415 2.7843 9.6733 152.0286 79.3399 32.8994 18.6964 3.0243 26.9345 36.3412 16.4871 6.8093 11.9177 9.3187 9.9075 1.9539 47.9105 23.3304 118.7989 95.0564 11.4203 4.3584 41.9805 87.8118 37.1340 23.6099 14.9507 14.1372 35.2966 28.9880 23.8237 8.7498 7.6476 108.7772 55.4883 2.4604 23.4252 322.3341 71.0895 42.4318 40.9950 335.9854 61.1933 52.9580 63.0612 34.6763 52.9609 329.0205 170.8778 48.6506 54.8062 174.6620 81.6401 125.9426 23.3115 177.5025 218.8774 57.5516 110.0513 82.5758 81.2658 39.1358 28.2173 25.0633 21.0880 6.2569 7.3251 19.2769 18.5342 36.4409 34.9437 7.5367 108.2787 14.3305 21.7788 15.3001 14.4165 17.7558 23.9100 17.2093 17.0671
temp: 298.150 k
press: 1.00000 atm
elementType: 7 7 7 7 7 7 7 7 6 6 6 6 6 6 6 6 6 6 6 6 6 6 6 6 1 1 1 1 1 1 1 1 1 1 1 1 1 1 1 1 1 1 1 1 1 1
symmnumber: 1
zpe: 989165.2 jmol-1
zpe.correction: 0.376753 hartree
zpe.thermalcorrener: 0.400746 hartree
zpe.thermalcorrenthalpy: 0.401691 hartree
zpe.thermalcorrgfe: 0.321291 hartree
zpe.sumelectzpe: -1059.157792 hartree
zpe.sumelectthermal: -1059.133799 hartree
zpe.sumelectthermalent: -1059.132855 hartree
zpe.sumelectthermalfe: -1059.213254 hartree
dipole: -0.6834 5.1101 -0.4045
dipole: 5.1715
quadrupole: -111.2492 -137.1205 -143.7445
quadrupole: 0.1503 8.3380 0.9247
quadrupole: 19.4555 -6.4158 -13.0397 0.1503 8.3380 0.9247
hfenergy: -1059.534545 hartree
pointgroup: C01 [X(C16H22N8)]
dipole: 0.2681442 2.0082492 0.1862269 debye
polarizability: 414.3048788|-0.6079802|235.9951341|41.6039616|4.1179536|141.8071791 unknown
InChI: InChI=1S/C16H22N8/c17-11-7-9(15(19)20)1-3-13(11)23-5-6-24-14-4-2-10(16(21)22)8-12(14)18/h1-4,7-8,19,21,23-24H,5-6,17-18,20,22H2
charge 0 multiplicity 1
46 atoms
N  -1.357447 0.86817 0.370327
N  1.365366 0.865498 -0.49802
N  -2.227992 -1.550926 1.359327
N  2.330385 -1.468133 -1.587266
N  -7.805459 0.270771 -0.549218
N  7.7488 0.26682 0.784055
N  -7.109409 -2.012067 -0.156002
N  7.147688 -1.974982 0.100785
C  -0.763514 2.073342 -0.208485
C  0.751679 2.080955 0.060606
C  -2.715269 0.55119 0.205543
C  2.714285 0.52461 -0.224341
C  -3.174381 -0.713032 0.718368
C  3.211945 -0.695346 -0.799972
C  -3.647489 1.406362 -0.432946
C  3.572863 1.298762 0.590532
C  -4.514496 -1.094878 0.532697
C  4.556758 -1.059702 -0.597979
C  -5.441165 -0.246085 -0.128651
C  5.42586 -0.262611 0.189829
C  -4.994899 1.014324 -0.598138
C  4.914443 0.907986 0.803617
C  -6.851003 -0.72084 -0.280704
C  6.843543 -0.714748 0.358045
H  -0.949367 2.141035 -1.308742
H  -1.213576 2.977635 0.245111
H  1.193497 3.015085 -0.354122
H  0.924821 2.086788 1.15273
H  -0.712914 0.068252 0.408884
H  1.074022 0.642002 -1.45941
H  -3.316488 2.36889 -0.83606
H  3.205409 2.221269 1.051078
H  -4.88496 -2.058903 0.898751
H  4.962971 -1.987378 -1.016176
H  -5.667222 1.680381 -1.151368
H  5.534075 1.507242 1.480304
H  -2.548959 -2.475693 1.644451
H  -1.561941 -1.108414 1.996188
H  2.703002 -2.314173 -2.016283
H  1.351899 -1.515721 -1.296565
H  -8.774662 0.013253 -0.720267
H  -7.579527 1.258904 -0.466305
H  8.718672 0.0214 0.969426
H  7.49214 1.250888 0.800474
H  -8.123074 -2.236135 -0.239046
H  8.162288 -2.182851 0.208437
