program: Gaussian 09
title: 000147918
version: EM64L-G09RevD.01
frameworkgroup: C1[X(C13H22O3)]
method: RPBEPBE
basis: SDD
operation: Freq
keyword: #pfreq=noraman
keyword: PBEPBE/SDD
title: #p freq=noraman PBEPBE/SDD
converged: YES YES NO NO
title: Mulliken charges:
elementType: O O O C C C C C C C C C C C C C H H H H H H H H H H H H H H H H H H H H H H
charge: -0.442689 -0.241307 -0.461634 0.185666 -0.488449 -0.102715 0.161820 -0.519035 0.212517 -0.747211 -0.722636 0.040206 -0.828525 -0.519668 -0.017175 -0.699208 0.193176 0.227990 0.205997 0.231053 0.246972 0.218438 0.220647 0.225792 0.225372 0.247921 0.202063 0.240080 0.242046 0.231313 0.243290 0.249496 0.333292 0.183658 0.242769 0.195131 0.220412 0.363134
chargesum: 0.00000
title: Mulliken charges with hydrogens summed into heavy atoms:
elementType: O O O C C C C C C C C C C C C C
charge: -0.109397 -0.241307 -0.098500 0.185666 -0.067284 0.103282 0.161820 -0.041010 0.212517 -0.082333 -0.047280 0.040206 -0.115086 -0.026883 0.166483 -0.040895
polarizability: 1.75036071e+02 -5.01404699e+00 1.55545327e+02 -2.37760744e-01 1.67457270e+00 1.18303011e+02
1716.lowfreq: -14.2959 -7.5648 0.0005 0.0007 0.0008 5.8260 22.6560 26.9521 52.8032
frequency: 22.5662 26.8244 52.7957 97.7021 114.5454 133.4335 142.1756 167.8440 190.4381 197.7154 201.8600 218.3221 244.9464 262.7653 267.9059 298.0162 303.4251 310.7252 338.7653 347.9929 371.6668 397.9934 413.0375 428.7744 445.9218 460.2726 493.0811 516.8292 553.5847 598.8567 629.0242 677.2399 727.7611 827.3318 828.5037 867.1808 887.9217 901.2568 904.8660 919.5540 930.8862 948.5429 960.4635 973.0395 1001.8375 1012.0082 1036.2925 1044.3477 1051.6723 1071.6060 1095.2394 1116.2964 1122.8710 1156.7186 1171.1464 1185.0370 1193.2007 1203.5385 1222.5622 1255.4240 1268.7129 1272.2605 1291.7277 1298.1413 1321.8965 1326.1061 1354.6627 1377.9134 1382.6842 1395.3437 1396.5935 1401.8060 1404.2950 1412.7650 1446.8918 1457.1426 1457.7444 1459.1903 1463.1822 1470.3328 1476.8780 1477.3537 1479.2504 1484.4098 1559.8108 1638.0009 2915.4488 2948.5226 2964.6303 2966.2189 2968.3150 2971.0522 2973.4738 2981.0236 2987.6288 3023.5100 3035.0513 3036.6358 3061.8398 3066.7499 3070.1802 3074.6824 3085.8995 3092.6691 3097.5219 3110.2377 3415.0171 3555.6900
redmass: 4.9435 3.8807 3.3211 3.4408 3.0276 2.5608 3.2123 1.6293 2.3143 1.4688 1.3037 1.6720 1.1228 2.0840 2.1848 2.1647 1.6407 2.4471 4.0941 3.1315 3.2365 2.5879 2.5667 3.4433 2.0937 2.1955 3.4584 3.6981 2.6598 3.2655 1.0978 4.5729 4.7776 2.9129 3.0482 1.6485 2.1651 2.4739 1.9679 1.8862 1.6303 2.0908 2.4966 2.0933 1.7469 1.4533 1.7418 1.7386 2.3579 1.8035 1.6735 1.6416 2.0306 2.4778 2.4359 1.6547 1.6251 2.1685 1.9192 1.7051 1.5164 1.1408 1.6762 1.4084 1.2232 1.8961 1.5141 1.1820 1.2385 1.3492 1.2376 1.4480 1.5322 1.1553 1.0914 1.0615 1.0656 1.0626 1.0593 1.0803 1.0566 1.0519 1.0591 1.0583 7.2682 7.0044 1.0835 1.0835 1.0410 1.0660 1.0556 1.0395 1.0596 1.0393 1.0359 1.0989 1.1003 1.0971 1.0917 1.0992 1.1001 1.0977 1.0996 1.0974 1.0995 1.0986 1.0648 1.0660
irintensity: 0.7258 2.9063 1.9380 1.5162 3.6130 2.2778 1.5531 0.1555 0.7774 0.2001 1.6806 3.2971 0.3678 13.5146 10.3395 24.5001 64.8687 50.4733 5.0276 0.2223 1.7660 2.4680 6.6533 2.1180 5.1525 13.7244 16.0644 14.3620 2.5532 3.9696 189.8920 11.3417 2.1807 4.8991 2.4984 1.2758 5.8968 9.2838 5.1678 10.3018 6.0657 1.3192 37.6157 9.7091 38.1864 10.0413 16.2831 54.5312 26.6914 32.4687 9.9083 1.2993 12.1190 35.4420 41.2714 25.4084 9.6311 5.6504 30.5656 1.2645 18.5343 75.3416 27.6510 25.5348 19.8640 34.4833 29.4952 22.8406 19.8970 10.0059 17.4258 17.0036 108.3134 42.6204 17.9313 17.1235 3.9156 7.7578 1.0076 10.2333 14.8890 7.3779 6.2517 16.9371 106.0648 31.1711 59.3299 30.4727 12.3604 11.2607 32.7271 39.0591 26.9022 43.4928 21.0798 14.2586 11.3232 40.2235 9.4531 23.1967 32.3100 48.6985 40.5363 21.2775 26.5347 21.4983 105.5267 3.1247
temp: 298.150 k
press: 1.00000 atm
elementType: 8 8 8 6 6 6 6 6 6 6 6 6 6 6 6 6 1 1 1 1 1 1 1 1 1 1 1 1 1 1 1 1 1 1 1 1 1 1
symmnumber: 1
zpe: 853662.6 jmol-1
zpe.correction: 0.325143 hartree
zpe.thermalcorrener: 0.343687 hartree
zpe.thermalcorrenthalpy: 0.344632 hartree
zpe.thermalcorrgfe: 0.278749 hartree
zpe.sumelectzpe: -732.952437 hartree
zpe.sumelectthermal: -732.933892 hartree
zpe.sumelectthermalent: -732.932948 hartree
zpe.sumelectthermalfe: -732.998831 hartree
dipole: 3.0683 -1.5530 1.9278
dipole: 3.9424
quadrupole: -115.4326 -97.2967 -97.6277
quadrupole: 15.6451 2.2655 3.5708
quadrupole: -11.9802 6.1556 5.8246 15.6451 2.2655 3.5708
hfenergy: -733.2775797 hartree
pointgroup: C01 [X(C13H22O3)]
dipole: 1.2339737 0.4125184 -0.8443377 debye
polarizability: 175.3206379|4.4624848|154.4504389|0.0158358|-5.6348007|119.113332 unknown
InChI: InChI=1S/C13H22O3/c1-8-5-10(15)7-13(3,4)12(8)11(16)6-9(2)14/h9-10,14-15H,5-7H2,1-4H3
charge 0 multiplicity 1
38 atoms
O  4.460506 0.705484 -0.674192
O  -1.633081 -1.009174 1.312497
O  -4.157444 -0.78887 0.170653
C  1.236093 -1.334471 0.111898
C  2.742108 -0.924879 0.115294
C  3.029754 0.343056 -0.699742
C  0.337155 -0.07341 0.229298
C  2.285606 1.522315 -0.07408
C  0.817802 1.212056 0.178946
C  0.886052 -2.085343 -1.210395
C  1.024788 -2.31195 1.305994
C  -1.145712 -0.318484 0.360405
C  -0.032272 2.448761 0.42217
C  -2.068557 0.194663 -0.752533
C  -3.525614 0.455689 -0.286357
C  -4.402136 1.001869 -1.416993
H  3.335611 -1.77927 -0.270384
H  3.072634 -0.738205 1.155957
H  2.699648 0.200768 -1.751946
H  2.367258 2.415345 -0.724295
H  2.797023 1.789532 0.873703
H  1.06011 -1.453414 -2.100671
H  1.505922 -2.996568 -1.304377
H  -0.172593 -2.404712 -1.220031
H  1.172403 -1.797589 2.27167
H  0.013912 -2.748542 1.313695
H  1.76269 -3.134073 1.230744
H  0.449323 3.07772 1.196272
H  -1.052518 2.225883 0.773725
H  -0.099814 3.075432 -0.489401
H  -1.630912 1.084867 -1.236353
H  -2.094381 -0.601845 -1.528254
H  4.988277 -0.048298 -1.042225
H  -3.497136 1.19224 0.550529
H  -5.433216 1.142828 -1.050608
H  -4.022413 1.971619 -1.787665
H  -4.434569 0.284703 -2.256622
H  -3.544709 -1.171132 0.861576
