program: Gaussian 09
title: 000009828
version: EM64L-G09RevD.01
frameworkgroup: C1[X(C8H7FO)]
method: RPBEPBE
basis: SDD
operation: Freq
keyword: #pfreq=noraman
keyword: PBEPBE/SDD
title: #p freq=noraman PBEPBE/SDD
converged: NO YES NO NO
title: Mulliken charges:
elementType: F O C C C C C C C C H H H H H H H
charge: -0.196108 -0.223561 0.303759 -0.305547 -0.313181 0.130909 -0.375167 -0.365078 0.333455 -0.787094 0.248681 0.284852 0.260159 0.262730 0.238483 0.263921 0.238787
chargesum: 0.00000
title: Mulliken charges with hydrogens summed into heavy atoms:
elementType: F O C C C C C C C C
charge: -0.196108 -0.223561 0.303759 -0.056866 -0.028329 0.130909 -0.115008 -0.102348 0.333455 -0.045902
polarizability: 1.25914227e+02 -2.07627022e+00 9.31994815e+01 -1.60789465e-02 -1.84819034e-02 4.05105717e+01
1716.lowfreq: -4.2806 -0.0008 -0.0006 0.0006 5.1292 16.7279 70.2799 104.4726 155.0767
frequency: 70.2264 104.4599 155.0740 188.9609 283.5433 326.9784 370.0079 411.5263 455.6959 483.5887 547.3625 589.8159 624.3342 659.3814 728.4552 803.8534 820.0496 847.5661 947.9922 953.0740 988.1896 1003.0656 1028.2358 1070.9433 1106.1316 1156.0328 1201.6653 1273.0208 1292.8518 1371.4932 1382.6592 1409.9305 1448.5726 1464.2939 1490.3503 1576.9985 1602.1614 1614.8892 2985.5895 3069.0998 3128.1376 3153.9137 3157.2001 3178.1387 3181.0276
redmass: 4.0479 7.9966 1.0313 5.0287 6.3866 5.6624 6.9290 2.9472 3.7970 3.1335 5.7784 2.4069 7.2008 4.6411 3.6034 6.6784 1.2850 1.4743 2.1780 1.3462 1.3414 2.9051 1.8198 2.4670 1.2833 1.4053 2.2731 4.2138 1.2689 1.4845 3.5574 4.0712 1.0950 1.0491 2.6178 7.2780 7.0397 7.3483 1.0380 1.0969 1.0989 1.0887 1.0892 1.0963 1.0973
irintensity: 4.1785 1.7258 0.4739 5.8236 0.4986 1.3842 3.3582 0.0173 0.6923 8.6795 32.4024 15.0474 0.4784 1.1756 0.8483 16.8288 15.5385 76.8793 28.1991 0.0027 1.2671 8.4486 1.3153 1.0984 13.2402 71.2720 19.2758 246.9520 5.2515 39.0644 28.9534 19.2412 28.9124 21.5681 22.2462 111.2368 106.4556 49.5147 3.3458 12.1369 14.4516 5.9378 0.1522 3.5170 3.9463
temp: 298.150 k
press: 1.00000 atm
elementType: 9 8 6 6 6 6 6 6 6 6 1 1 1 1 1 1 1
symmnumber: 1
zpe: 333199.1 jmol-1
zpe.correction: 0.126909 hartree
zpe.thermalcorrener: 0.135748 hartree
zpe.thermalcorrenthalpy: 0.136692 hartree
zpe.thermalcorrgfe: 0.092746 hartree
zpe.sumelectzpe: -483.401152 hartree
zpe.sumelectthermal: -483.392313 hartree
zpe.sumelectthermalent: -483.391369 hartree
zpe.sumelectthermalfe: -483.435315 hartree
dipole: -0.1761 2.6220 -0.0045
dipole: 2.6279
quadrupole: -67.3194 -52.2264 -59.1391
quadrupole: 8.9722 -0.0087 0.0079
quadrupole: -7.7578 7.3352 0.4225 8.9722 -0.0087 0.0079
hfenergy: -483.5280612 hartree
pointgroup: C01 [X(C8H7F1O1)]
dipole: 0.0950411 -1.0295314 -0.0018422 debye
dipolederiv: -1.2399605 0.0090316 -0.0012562 0.0105054 -0.2103484 0.0000038 -0.0015278 -0.000006 -0.1492792 -0.9077825 0.1308012 -0.0007457 0.3380572 -0.7342343 0.0014424 0.0015211 -0.0013879 -0.3175646 -0.8130937 -0.0283154 -0.0000795 -0.0889051 -0.1878334 0.0000755 -0.0012061 -0.000211 -0.0233517 0.2451266 0.0243735 0.0005957 -0.1007381 0.0737927 -0.0002025 -0.0006029 0.0002271 -0.1255947 0.1564161 -0.0594869 0.0004838 0.1217273 0.0746556 0.0000202 -0.0001642 0.000011 -0.0916535 1.7239131 0.0560552 0.0001716 0.0168217 0.9093811 -0.0015042 -0.000514 -0.0000747 0.1268783 -0.36184 -0.0743785 -0.0002139 -0.3087514 -0.0613618 -0.0003544 -0.0002624 -0.0001376 -0.1607373 -0.2973361 0.1083791 -0.0000737 0.2736768 -0.0570723 0.0004344 -0.0000423 0.0002194 -0.162634 1.3785883 -0.0126871 0.0015476 0.0164271 0.3609997 0.0000788 0.0016396 0.0000222 0.1114456 -0.209843 -0.1893321 0.0005597 -0.3155918 -0.372654 0.0011137 0.0023269 0.002608 0.0504113 0.0651569 -0.0857995 -0.0001768 -0.0849474 -0.0263603 -0.0000922 -0.0001626 -0.0001704 0.1427815 0.1130068 0.0725068 -0.0001249 0.0206743 0.0309549 0.0000597 -0.0001706 0.0000207 0.1538098 0.0467012 0.0587112 -0.0000979 0.07057 0.0028873 0.0000607 -0.0000076 0.000127 0.1827 0.0402129 -0.064496 -0.0001387 -0.0705286 0.0108575 -0.0001404 -0.0000631 -0.0001695 0.1823427 0.0819088 0.0283996 0.0815281 0.0170648 0.046421 -0.0738197 0.0484993 -0.0894102 -0.0219551 -0.1017316 -0.0021292 0.0003428 0.0663422 0.0926852 -0.0001653 0.0005519 -0.0000331 0.1235796 0.0805568 0.0283663 -0.0823221 0.0175957 0.0472296 0.0729896 -0.0498153 0.0883649 -0.0211784 unknown
polarizability: 125.9975212|-1.2560937|93.1161435|0.0593936|0.0242068|40.5106152 unknown
InChI: InChI=1S/C8H7FO/c1-6(10)7-2-4-8(9)5-3-7/h2-5H,1H3
charge 0 multiplicity 1
17 atoms
F  3.53571 -0.03176 0.00314
O  -2.759347 1.210028 0.000549
C  -0.668919 0.015239 -0.002539
C  0.036249 -1.21887 -0.001748
C  0.066138 1.233921 -0.001165
C  -2.171498 0.088392 -0.00477
C  1.44623 -1.243954 0.000064
C  1.47278 1.230368 0.000674
C  2.12975 -0.015072 0.00123
C  -2.973083 -1.208752 -0.00001
H  -0.509651 -2.16745 -0.002651
H  -0.497215 2.172586 -0.00176
H  2.009004 -2.181569 0.000606
H  2.055094 2.156059 0.001645
H  -2.743968 -1.822219 -0.891478
H  -4.046113 -0.966317 0.002908
H  -2.738561 -1.819431 0.892005
