program: Gaussian 09
title: 000147892
version: EM64L-G09RevD.01
frameworkgroup: C1[X(C14H16N4O6)]
method: RPBEPBE
basis: SDD
operation: Freq
keyword: #p
keyword: freq=noraman
keyword: PBEPBE/SDD
title: #p freq=noraman PBEPBE/SDD
converged: NO YES NO NO
title: Mulliken charges:
elementType: O O O O O O N N N N C C C C C C C C C C C C C C H H H H H H H H H H H H H H H H
charge: -0.247973 -0.248462 -0.300831 -0.300809 -0.268165 -0.268177 -0.096346 -0.096392 -0.452491 -0.452467 -0.399762 -0.376319 -0.399821 -0.376174 0.259575 0.260270 0.198997 0.198932 -0.156590 -0.154609 0.248136 0.248015 -0.492678 -0.492666 0.247784 0.268063 0.249132 0.256459 0.247807 0.267907 0.249055 0.256625 0.353489 0.353432 0.232199 0.243623 0.232687 0.232201 0.243633 0.232708
chargesum: 0.00000
title: Mulliken charges with hydrogens summed into heavy atoms:
elementType: O O O O O O N N N N C C C C C C C C C C C C C C
charge: -0.247973 -0.248462 -0.300831 -0.300809 -0.268165 -0.268177 -0.096346 -0.096392 -0.099002 -0.099035 0.116086 0.129273 0.115893 0.129506 0.259575 0.260270 0.198997 0.198932 -0.156590 -0.154609 0.248136 0.248015 0.215831 0.215877
polarizability: 2.95292816e+02 -2.01176647e+01 2.71744651e+02 -1.37523054e-02 1.52271016e-02 1.25522331e+02
1716.lowfreq: -2.9092 -0.0006 -0.0003 0.0001 1.5159 8.6267 27.3156 38.5343 47.8098
frequency: 27.3129 38.4799 47.8039 54.4514 59.0373 66.5453 70.4178 73.7054 76.3233 88.9231 101.3637 123.8800 126.1414 136.6428 141.7621 146.8121 146.9424 163.1363 169.9491 209.9930 235.8643 241.3657 264.0300 277.1532 319.7471 327.4936 328.5470 359.0150 394.7022 399.5762 445.7273 469.9005 482.0452 574.9898 590.4815 604.6376 639.9497 645.9341 672.5123 673.5446 714.6786 727.9484 731.8413 771.8038 773.2650 783.1451 783.8186 787.4512 815.2511 885.1020 916.7817 929.9736 967.3261 975.9448 989.9806 990.2002 1008.5858 1033.9731 1070.0509 1079.9911 1100.1534 1104.6362 1115.5321 1117.1967 1119.2571 1119.3011 1119.9167 1123.5936 1127.2305 1132.3816 1141.3907 1147.9122 1151.4387 1187.5379 1203.5040 1212.2866 1319.2315 1344.1851 1425.6244 1425.9772 1452.4027 1452.4155 1453.9922 1458.1418 1460.5698 1460.8375 1468.0471 1468.0935 1475.4728 1477.1729 1495.0355 1504.7321 1518.1162 1525.3785 1641.3515 1648.0818 1672.0420 1678.6636 2998.8262 2998.9445 3073.3455 3073.4559 3084.6055 3084.9001 3097.7617 3097.7667 3142.1998 3142.2112 3183.0716 3183.1262 3198.3013 3198.3452 3462.7480 3462.8065
redmass: 5.4576 3.9655 5.5639 5.0903 2.9450 2.1228 4.1546 1.8615 2.0844 2.7268 3.1858 2.4159 2.4945 3.4988 4.6467 4.4830 4.3951 4.8507 4.5478 6.1632 9.1796 4.8809 5.2216 6.3428 5.4769 5.6571 6.0250 8.1919 7.1399 6.6647 6.6356 11.4853 9.2870 8.9913 6.5328 5.4738 3.1900 4.4171 3.6215 4.7827 4.5670 3.1698 1.9629 5.2427 6.4789 1.0532 1.0363 9.8712 5.3303 6.7097 6.6652 6.4844 5.8791 4.7508 1.1031 1.3916 3.5619 4.5674 2.1001 5.1536 1.3096 1.3438 1.3681 1.3416 1.2739 1.2570 1.3805 2.0392 1.6473 1.5752 2.9855 1.4560 1.6646 5.1268 2.7022 2.2969 4.9411 6.6091 1.1701 1.1728 1.0574 1.0511 2.0248 1.6770 1.2529 1.1488 1.0727 1.0742 2.1905 1.8975 2.4501 2.2030 6.2474 3.9273 10.9087 10.5766 8.3490 8.7301 1.0300 1.0300 1.0518 1.0517 1.0581 1.0581 1.1044 1.1044 1.1041 1.1041 1.1173 1.1173 1.1157 1.1157 1.0744 1.0744
irintensity: 0.5031 3.2703 1.6521 2.0338 0.8968 0.0368 14.9278 1.2596 0.0292 1.0192 5.3644 0.1400 1.5150 11.6073 9.4835 6.8422 0.5561 0.1783 5.8430 0.0013 1.5218 18.7131 0.0467 7.5702 0.0394 5.1732 36.7803 3.7756 30.3605 0.0127 30.5677 2.3869 3.8561 5.8172 6.6983 10.8277 18.2234 6.1783 14.4972 3.9608 37.8835 98.6102 23.7585 41.2855 8.9093 0.1223 44.7164 5.4568 10.5959 42.2207 4.1929 53.9647 95.7323 1.1956 3.7167 7.2009 36.7400 108.9083 0.0294 185.8025 2.0300 0.3407 16.8327 0.0320 7.2053 0.0834 44.3554 5.3085 11.9373 65.1349 29.4200 137.9515 0.2408 120.5695 386.7184 1.3067 395.4520 1.6049 20.6478 2.8365 26.5405 17.0394 365.3542 28.0663 4.8346 6.5060 4.3722 106.8960 21.7130 396.7014 108.2655 686.4568 277.1638 2.5571 228.0649 139.5080 569.2217 88.2585 90.2802 18.2864 24.2992 10.3686 17.6171 54.1908 27.9012 32.3882 33.6216 4.2226 1.9997 0.8033 6.7141 19.4654 60.2827 46.0497
temp: 298.150 k
press: 1.00000 atm
elementType: 8 8 8 8 8 8 7 7 7 7 6 6 6 6 6 6 6 6 6 6 6 6 6 6 1 1 1 1 1 1 1 1 1 1 1 1 1 1 1 1
symmnumber: 1
zpe: 779278.6 jmol-1
zpe.correction: 0.296812 hartree
zpe.thermalcorrener: 0.321837 hartree
zpe.thermalcorrenthalpy: 0.322781 hartree
zpe.thermalcorrgfe: 0.239715 hartree
zpe.sumelectzpe: -1211.563498 hartree
zpe.sumelectthermal: -1211.538473 hartree
zpe.sumelectthermalent: -1211.537529 hartree
zpe.sumelectthermalfe: -1211.620595 hartree
dipole: 0.0026 0.0047 -3.8628
dipole: 3.8628
quadrupole: -102.6887 -135.8226 -135.6742
quadrupole: -8.0922 0.0306 0.0240
quadrupole: 22.0398 -11.0941 -10.9457 -8.0922 0.0306 0.0240
hfenergy: -1211.8603098 hartree
pointgroup: C01 [X(C14H16N4O6)]
dipole: -0.0008814 -0.0013665 -1.5197339 debye
polarizability: 292.2364358|-21.6183088|274.8010208|0.0356463|0.0213972|125.5223409 unknown
InChI: InChI=1S/C14H16N4O6/c1-23-13(21)15-7-9(17-3-4-17)12(20)8(16-14(22)24-2)10(11(7)19)18-5-6-18/h15-16H,3-6H2,1-2H3
charge 0 multiplicity 1
40 atoms
O  0.880079 2.586964 -0.483588
O  -0.879866 -2.587073 -0.488736
O  4.918247 1.02727 0.428041
O  -4.91802 -1.0271 0.4277
O  3.730522 -0.805613 1.316747
O  -3.730941 0.808003 1.312766
N  -1.820233 2.128192 -0.515183
N  1.820281 -2.128845 -0.514535
N  2.790051 0.702937 -0.260272
N  -2.790027 -0.703056 -0.261519
C  -3.061214 2.5633 -1.157514
C  -1.805648 3.466778 -1.086696
C  3.060817 -2.564203 -1.157575
C  1.805132 -3.467439 -1.086016
C  -1.004054 1.052963 -0.423845
C  1.00425 -1.053526 -0.422809
C  1.434595 0.27459 -0.306517
C  -1.434449 -0.275091 -0.307153
C  0.479551 1.367668 -0.393182
C  -0.479324 -1.368316 -0.391507
C  3.780079 0.201557 0.568524
C  -3.780656 -0.199796 0.5654
C  6.056683 0.651723 1.288918
C  -6.055948 -0.651284 1.289126
H  -3.314357 2.10867 -2.123912
H  -3.90153 2.758118 -0.485575
H  -1.785948 4.295238 -0.371213
H  -1.212173 3.625938 -1.993963
H  3.313485 -2.109694 -2.124155
H  3.901477 -2.759157 -0.486114
H  1.785649 -4.295845 -0.370468
H  1.211161 -3.626555 -1.992976
H  2.930711 1.665013 -0.594756
H  -2.930649 -1.665704 -0.59435
H  6.420946 -0.358173 1.033077
H  5.761292 0.669054 2.351734
H  6.825422 1.409764 1.081698
H  -6.421727 0.357661 1.031695
H  -5.759378 -0.666158 2.35165
H  -6.823986 -1.410673 1.084251
