program: Gaussian 09
title: 000147901
version: EM64L-G09RevD.01
frameworkgroup: C1[X(C25H26ClNO2)]
method: RPBEPBE
basis: SDD
operation: Freq
keyword: #p
keyword: freq=noraman
keyword: PBEPBE/SDD
title: #p freq=noraman PBEPBE/SDD
converged: YES YES NO NO
title: Mulliken charges:
elementType: Cl O O N C C C C C C C C C C C C C C C C C C C C C C C C C H H H H H H H H H H H H H H H H H H H H H H H H H H
charge: -0.083625 -0.267254 -0.431261 -0.307784 0.101746 0.164154 -0.532478 0.282947 0.291847 0.304439 -0.404728 -0.372586 -0.601510 -0.372789 -0.379556 -0.389148 -0.417184 0.337545 -0.370395 -0.381151 -0.354985 -0.394270 -0.228441 -0.239404 0.272650 -0.282246 -0.248077 -0.390340 -0.621193 0.276962 0.237323 0.231625 0.256303 0.289433 0.259513 0.259411 0.253446 0.254410 0.232027 0.250855 0.250285 0.251686 0.218367 0.226245 0.225634 0.192881 0.232920 0.228774 0.223815 0.205381 0.255026 0.354046 0.230230 0.223909 0.194569
chargesum: 0.00000
title: Mulliken charges with hydrogens summed into heavy atoms:
elementType: Cl O O N C C C C C C C C C C C C C C C C C C C C C C C C C
charge: -0.083625 -0.267254 -0.077215 -0.052759 0.101746 0.164154 -0.018193 0.282947 0.291847 0.304439 -0.173103 -0.116282 -0.052564 -0.113379 -0.126110 -0.134739 -0.185157 0.337545 -0.119540 -0.130866 -0.103299 -0.175904 -0.002196 -0.013770 0.272650 0.143555 -0.019303 0.038856 0.027515
polarizability: 4.40201823e+02 -7.98304710e+00 3.29357371e+02 2.23226071e+00 -1.03419049e+01 2.03991260e+02
1716.lowfreq: -3.9834 0.0008 0.0011 0.0019 2.3051 4.6709 16.0382 20.4704 28.1160
frequency: 16.0007 20.4098 28.0581 37.6037 40.6459 49.7872 51.8027 54.9685 60.7379 70.5757 77.0282 95.1417 111.9480 131.4818 144.6934 148.4608 163.5368 175.9994 195.4373 209.3758 218.5478 231.4860 258.3292 287.7082 294.1947 312.8082 346.1457 366.3383 367.0877 387.3444 401.4249 403.9955 412.5206 417.2305 450.3830 473.4580 499.5870 517.0941 526.5200 541.6504 583.0235 595.9283 615.1762 624.1987 632.8125 641.2401 664.8783 670.6660 698.4412 706.0687 728.7518 741.3229 761.7750 776.4089 789.0223 798.5686 807.9161 812.6019 821.1861 837.0393 839.6967 845.8250 852.3621 903.5406 923.7951 939.0537 945.2858 959.1543 966.8838 970.8555 977.5182 979.9070 986.4264 987.9405 994.1590 1003.2002 1004.2373 1021.1178 1042.3734 1047.0940 1058.8182 1084.7221 1085.4187 1105.0133 1116.6564 1121.3338 1134.9879 1143.9857 1153.0142 1169.9581 1172.1755 1177.4595 1181.8574 1186.3520 1192.3329 1223.9032 1229.7271 1245.9437 1249.7756 1260.0469 1275.6146 1276.2024 1288.7079 1305.7738 1309.9626 1319.3838 1325.4812 1326.8090 1356.9935 1369.6970 1378.1398 1391.1919 1418.4954 1423.2654 1431.8650 1436.8723 1453.1962 1454.6311 1469.1785 1471.7731 1475.0500 1479.5083 1487.6693 1495.7205 1496.9919 1499.5861 1566.4466 1571.4743 1582.8598 1590.0649 1605.2193 1616.1003 1619.5239 2881.4416 2895.8654 2949.9199 2992.3464 3018.9922 3025.5518 3047.8877 3058.6895 3078.7948 3087.3033 3111.7166 3120.8425 3127.6581 3136.1242 3140.3800 3140.6287 3143.3972 3146.1444 3148.7428 3151.0404 3163.9075 3164.9141 3168.0884 3172.7831 3451.0114 3580.7861
redmass: 5.2714 6.5057 4.8765 4.1890 6.5097 4.7667 3.9661 4.2116 3.5219 4.0873 2.7934 3.0178 2.6654 4.4453 2.9160 4.1359 4.6314 4.2819 5.1275 3.6314 4.7952 1.8556 2.9485 4.3658 5.8490 3.5046 5.1188 1.2734 2.8968 3.5092 3.6055 2.8614 2.9758 3.0172 4.6514 4.9586 3.8969 2.9050 3.3158 4.5789 4.1134 5.0087 6.3739 6.4536 6.9111 4.5217 3.4132 1.6149 2.9165 2.0957 3.9182 3.0946 1.9599 2.1925 2.3920 4.2586 1.4984 1.7357 1.9255 1.1738 1.5572 1.7313 1.2578 4.2063 1.5150 1.3571 1.3798 2.8211 1.3563 1.3517 1.4019 3.1508 2.4848 5.6412 1.3177 2.5600 2.6722 2.7476 1.5207 2.9573 2.5206 1.6932 2.0041 1.4609 1.3509 1.5840 1.2811 1.3577 1.4868 3.0513 1.0825 1.4384 1.2558 1.7420 1.1254 1.5038 3.0109 1.4271 2.1390 2.4833 1.1159 1.3246 2.3290 1.4695 1.3598 1.5812 1.3129 1.3190 4.5506 5.9320 4.4903 1.4671 3.9321 3.4711 2.3195 1.1491 1.2053 1.0958 1.0738 1.1993 1.1366 1.8841 1.1087 1.9958 1.1654 2.4317 7.2015 6.7677 6.3577 7.2390 6.0710 6.3358 6.3468 1.0564 1.0695 1.0605 1.0664 1.0762 1.0928 1.0992 1.0566 1.0999 1.0934 1.0887 1.0849 1.0870 1.0882 1.0884 1.0921 1.1103 1.0939 1.0894 1.0957 1.0947 1.1014 1.0963 1.0967 1.0744 1.0660
irintensity: 0.3223 0.1026 0.1968 1.1043 0.6749 0.6226 0.2507 0.1760 0.1089 0.5813 1.9527 1.6036 2.2838 0.4034 3.7454 1.1949 2.2573 1.8641 0.5122 5.1288 1.3418 2.8826 2.7414 3.2420 0.3540 1.2967 4.2993 103.3754 29.2133 14.7319 5.7856 0.2085 0.0450 1.1772 4.1626 8.0507 8.8648 21.5361 13.3346 8.5386 21.6938 49.9969 0.8334 7.3099 4.6181 17.8800 45.3094 69.1544 58.6839 9.0319 2.3328 10.1450 11.2868 73.6895 7.8548 9.3100 19.4176 24.9705 2.3253 4.9368 49.1403 40.1448 0.3070 4.8319 8.8448 0.5711 0.4038 39.3394 0.6854 1.1340 1.7734 57.4528 12.4740 0.4441 1.1289 2.3542 7.7283 15.7760 51.7477 2.6522 5.6259 6.7684 1.4393 70.8108 15.3881 2.4857 7.5783 268.3502 22.5462 42.0458 3.0021 120.7194 11.8471 17.0533 0.0186 1.2877 315.0314 15.0392 22.0299 30.0719 2.3200 23.3183 9.6787 1.4319 9.3683 9.6982 0.6363 13.1167 29.0028 5.5278 22.8421 5.5909 7.9868 3.4938 8.2498 2.8217 30.3820 8.8210 9.0462 13.6956 36.2267 7.7894 62.0141 52.8410 11.8021 131.9065 7.3992 8.7564 11.1027 29.9124 16.3586 127.8656 57.8257 140.3572 105.8225 42.9241 11.6303 46.3163 10.5871 50.7342 15.5879 39.2676 5.5763 23.3658 5.9851 0.3222 16.4415 13.8799 17.6170 11.4376 15.2702 3.1267 34.1969 15.8458 26.7507 5.5930 5.3964 0.9255 54.2696
temp: 298.150 k
press: 1.00000 atm
elementType: 17 8 8 7 6 6 6 6 6 6 6 6 6 6 6 6 6 6 6 6 6 6 6 6 6 6 6 6 6 1 1 1 1 1 1 1 1 1 1 1 1 1 1 1 1 1 1 1 1 1 1 1 1 1 1
symmnumber: 1
zpe: 1166735.2 jmol-1
zpe.correction: 0.444386 hartree
zpe.thermalcorrener: 0.472691 hartree
zpe.thermalcorrenthalpy: 0.473635 hartree
zpe.thermalcorrgfe: 0.381405 hartree
zpe.sumelectzpe: -1631.393213 hartree
zpe.sumelectthermal: -1631.364907 hartree
zpe.sumelectthermalent: -1631.363963 hartree
zpe.sumelectthermalfe: -1631.456194 hartree
dipole: 1.7614 -3.3490 2.7181
dipole: 4.6590
quadrupole: -151.5200 -185.8789 -169.7628
quadrupole: -10.2736 5.5024 -8.8651
quadrupole: 17.5339 -16.8250 -0.7089 -10.2736 5.5024 -8.8651
hfenergy: -1631.8375986 hartree
pointgroup: C01 [X(C25H26Cl1N1O2)]
dipole: -0.5932335 -1.2977759 -1.1505304 debye
polarizability: 438.7297703|13.8611314|329.2123745|7.0014926|17.2628443|205.608309 unknown
InChI: InChI=1S/C25H26ClNO2/c1-27-17-18-29-23-13-9-21(10-14-23)25(20-7-11-22(28)12-8-20)24(15-16-26)19-5-3-2-4-6-19/h2-14,27-28H,15-18H2,1H3
charge 0 multiplicity 1
55 atoms
Cl -0.392454 5.175475 0.474566
O  -4.746608 -0.991331 0.400735
O  4.082704 -4.664775 -0.227896
N  -8.099309 -0.098907 -0.933575
C  0.899668 0.106471 0.242318
C  1.450273 1.370278 0.399398
C  0.61971 2.56957 0.865429
C  -0.579843 -0.134846 0.266775
C  1.739958 -1.127903 0.095369
C  2.896634 1.668979 0.135291
C  -1.478904 0.610066 -0.53978
C  -1.13004 -1.16893 1.080617
C  0.553127 3.673074 -0.199695
C  2.888426 -1.355343 0.906787
C  1.372989 -2.143441 -0.828861
C  3.523596 1.215912 -1.06088
C  3.66605 2.468328 1.027125
C  -3.390528 -0.653718 0.305484
C  -2.869642 0.365115 -0.530384
C  -2.510622 -1.421911 1.110742
C  3.651295 -2.530261 0.789357
C  2.1340 -3.322485 -0.96774
C  4.868053 1.532276 -1.344064
C  5.015109 2.779959 0.748836
C  3.278204 -3.514011 -0.156052
C  -5.707058 -0.221029 -0.409084
C  5.624723 2.313389 -0.438514
C  -7.097977 -0.779252 -0.089495
C  -9.50171 -0.30403 -0.525097
H  -0.399075 2.258972 1.144582
H  1.083219 3.004577 1.772602
H  -1.083021 1.381018 -1.210121
H  -0.459491 -1.77184 1.702378
H  1.545822 4.058487 -0.473402
H  -0.00207 3.367009 -1.098867
H  3.178406 -0.60174 1.645553
H  0.481074 -2.005221 -1.449584
H  2.943912 0.614542 -1.769095
H  3.216419 2.834829 1.957331
H  -3.523842 0.962382 -1.17202
H  -2.932444 -2.206188 1.746746
H  4.528667 -2.705815 1.418614
H  1.834375 -4.086727 -1.697111
H  5.325659 1.172875 -2.27276
H  5.58915 3.386422 1.458646
H  -5.468525 -0.344289 -1.487599
H  -5.658557 0.854719 -0.152817
H  6.669978 2.558511 -0.657337
H  -7.333301 -0.567737 0.969923
H  -7.081666 -1.890162 -0.202428
H  -7.956206 -0.296827 -1.932518
H  3.737403 -5.294037 -0.908932
H  -9.658274 0.124321 0.481992
H  -10.170964 0.231511 -1.221343
H  -9.821872 -1.373812 -0.489647
