program: Gaussian 09
title: 000147861
version: EM64L-G09RevD.01
frameworkgroup: C1[X(C11H8N6)]
method: RPBEPBE
basis: SDD
operation: Freq
keyword: #pfreq=noraman
keyword: PBEPBE/SDD
title: #p freq=noraman PBEPBE/SDD
converged: NO YES NO NO
title: Mulliken charges:
elementType: N N N N N N C C C C C C C C C C C H H H H H H H H
charge: -0.217753 -0.049053 -0.017095 -0.063554 0.016285 -0.018291 0.182060 0.345368 -0.023164 -0.084278 0.074223 -0.315521 -0.319927 -0.655621 -0.280509 -0.205694 -0.371997 0.257588 0.265034 0.244678 0.278305 0.244679 0.243503 0.228421 0.242312
chargesum: 0.00000
title: Mulliken charges with hydrogens summed into heavy atoms:
elementType: N N N N N N C C C C C C C C C C C
charge: -0.217753 -0.049053 -0.017095 -0.063554 0.016285 -0.018291 0.182060 0.345368 -0.023164 -0.084278 0.074223 -0.057933 -0.054893 0.112041 -0.037006 0.022727 -0.129686
polarizability: 3.18391176e+02 2.15887838e+01 1.64988056e+02 1.80133982e-02 -1.32717729e-03 6.47196691e+01
1716.lowfreq: 0.0006 0.0009 0.0010 4.0635 7.0253 9.6793 51.0256 87.9211 93.3840
frequency: 50.9993 87.9165 93.3834 115.7381 187.5904 199.3471 200.5061 226.6967 278.2442 308.2692 355.0121 361.0405 374.1278 425.9088 441.1223 490.5298 520.0425 525.6951 569.3858 579.1367 596.4952 652.4103 671.2924 678.8751 714.4861 768.0259 783.7615 815.3368 820.9244 847.2365 881.5040 927.2457 976.2828 981.0063 992.6168 1028.3421 1048.4590 1112.9663 1118.4391 1125.3723 1145.4575 1220.6623 1227.8391 1259.3546 1279.5349 1289.9704 1334.0950 1368.5516 1375.8526 1398.7374 1417.2729 1445.9294 1448.4508 1480.9924 1485.6324 1489.6757 1517.5422 1566.4549 1579.8282 1618.3192 2084.5700 2992.0498 3079.6730 3119.9705 3125.2749 3152.9528 3160.2600 3176.5785 3181.9759
redmass: 8.3455 3.4509 9.9802 6.5519 4.4409 5.2941 5.8519 1.1111 3.3813 4.6581 7.0764 6.1219 10.4866 3.8152 12.9954 9.3106 4.4167 7.1955 3.1984 4.8983 6.7989 7.6735 10.5792 6.4764 3.3480 7.3774 1.5655 8.5225 3.3424 1.7628 4.6460 1.3913 1.3626 1.3375 5.0330 3.6861 2.4096 2.0775 1.6925 1.3076 1.5738 1.6967 2.1071 5.2893 6.1442 3.7423 4.2906 2.5363 3.6737 2.6190 2.2228 2.5109 3.0010 2.4601 1.0434 1.3653 4.2587 6.4815 7.7951 7.6669 13.9961 1.0347 1.1029 1.0993 1.0891 1.0905 1.0880 1.0975 1.0983
irintensity: 0.0403 0.3005 0.0511 2.3523 5.6527 1.3640 0.2410 0.4182 5.9461 3.1605 0.0124 1.2737 0.1847 1.5666 1.3780 1.9416 0.1546 2.6773 6.1733 10.9027 2.4075 11.3413 5.9821 4.2411 2.9038 1.6724 24.7295 5.1476 21.7865 55.2605 1.1761 1.0804 0.1874 0.2813 16.1739 0.3611 5.8760 13.9905 15.9331 0.2370 2.4874 1.8362 3.7090 29.0972 11.6558 19.9140 13.8143 26.6343 2.5828 46.6869 0.6663 3.5320 115.1041 81.3195 18.3746 103.7548 20.1296 3.8861 7.4077 5.4925 831.4039 30.4416 17.5155 2.5649 18.1821 18.1315 0.2678 23.3860 7.3120
temp: 298.150 k
press: 1.00000 atm
elementType: 7 7 7 7 7 7 6 6 6 6 6 6 6 6 6 6 6 1 1 1 1 1 1 1 1
symmnumber: 1
zpe: 472257.1 jmol-1
zpe.correction: 0.179873 hartree
zpe.thermalcorrener: 0.192984 hartree
zpe.thermalcorrenthalpy: 0.193928 hartree
zpe.thermalcorrgfe: 0.140044 hartree
zpe.sumelectzpe: -751.270003 hartree
zpe.sumelectthermal: -751.256892 hartree
zpe.sumelectthermalent: -751.255948 hartree
zpe.sumelectthermalfe: -751.309832 hartree
dipole: -0.6863 -4.9373 0.0001
dipole: 4.9848
quadrupole: -109.0747 -87.1086 -99.6960
quadrupole: 1.3784 -0.0005 -0.0003
quadrupole: -10.4482 11.5178 -1.0696 1.3784 -0.0005 -0.0003
hfenergy: -751.4498764 hartree
pointgroup: C01 [X(C11H8N6)]
dipole: 0.2919299 -1.9393084 -0.0000516 debye
dipolederiv: -0.3701945 -0.0602482 -0.0000259 -0.0150771 -0.6835986 -0.0000286 -0.0000199 -0.0000573 -0.1201661 -0.5889926 -0.0636606 -0.0000267 -0.2925457 -0.5205506 -0.0000368 -0.000032 -0.0000116 -0.235573 -0.3415506 -0.0032962 -0.0000051 0.0651322 -0.3145845 0.0000011 -0.0000045 -0.0000017 -0.2385747 -1.6781284 0.2516443 -0.0000923 0.601775 -0.3443999 0.0000364 -0.0000925 0.0000113 -0.1588297 2.2267492 -0.5547947 0.0001312 -1.3475043 0.288252 -0.000088 0.0000831 -0.0000354 0.1145988 -1.5115561 0.1778723 -0.0000958 0.6433782 -0.0954935 0.0000431 -0.0000678 0.0000117 -0.0553341 -0.1153849 0.3589979 0.000018 0.3158696 0.1539156 0.0000362 0.0000071 0.0000356 0.0335466 0.4250594 -0.2379749 0.0000186 0.120111 -0.2203254 0.0000023 0.0000356 -0.0000255 0.0562805 0.3842919 0.1343159 0.0000291 -0.0535253 -0.091351 -0.0000104 0.0000125 0.0000047 0.0009952 0.0469957 0.0085679 -0.0000014 -0.6163216 0.233177 -0.0000392 -0.0000215 0.0000075 0.0457702 1.3346081 -0.1209065 0.0000584 0.1345523 0.6357609 0.0000358 0.0001007 0.0000219 0.1666491 0.1487508 0.0083833 0.0000204 0.1335733 0.1747618 0.0000229 0.0000235 0.0000156 -0.1444742 -0.3037529 0.0561234 -0.0000077 0.2381532 0.0268801 0.000022 -0.0000037 0.0000104 -0.167594 0.0532348 -0.0345242 -0.0000116 0.0051047 0.4621244 0.0000028 -0.0000076 0.000002 0.2262186 0.0459951 0.0192357 0.000014 0.003973 0.1235368 0.0000014 0.0000111 -0.0000011 -0.1308771 -0.2531964 -0.0358592 -0.0000119 -0.1463077 0.0258266 -0.0000097 -0.0000119 0.0000008 -0.1210724 0.3433259 -0.0037348 0.0000334 0.1432677 0.1262662 0.0000184 0.000026 0.0000073 -0.075204 0.0724782 0.074662 -0.0000037 0.0270789 -0.0320075 -0.0000052 -0.000001 -0.0000046 0.163086 0.0366439 -0.0941896 -0.0000124 -0.0376438 0.0021393 -0.0000077 -0.0000102 -0.0000125 0.1611826 0.0607766 0.1022082 -0.0948781 0.0115567 -0.0113924 0.0149151 -0.0784611 0.0624305 -0.0395087 -0.0151266 -0.0987285 -0.0000255 -0.0313025 0.10855 -0.0000016 -0.0000215 -0.0000067 0.1310634 0.0607354 0.102218 0.0949111 0.0115566 -0.011373 -0.0149078 0.0784846 -0.0623967 -0.0394715 0.0657776 -0.101997 -0.0000055 -0.0586805 -0.0498717 -0.0000074 -0.000005 -0.0000078 0.1319138 0.0304099 0.0802002 -0.0000089 0.1193216 -0.0666534 0.0000043 -0.0000084 0.0000022 0.1629729 -0.1579496 0.0354852 -0.0000217 0.0245044 0.0804107 0.0000006 -0.0000158 -0.0000007 0.1324016 unknown
polarizability: 318.8592061|-19.8509261|164.5200256|0.0179973|0.0015305|64.7196691 unknown
InChI: InChI=1S/C11H8N6/c1-17-10-7-3-2-6-13-8(7)4-5-9(10)14-11(17)15-16-12/h2-6H,1H3
charge 0 multiplicity 1
25 atoms
N  -1.004739 -1.018252 -0.000166
N  -1.889324 1.11081 -0.000116
N  3.712725 0.821809 0.00028
N  -3.404676 -0.844328 -0.000279
N  -4.459162 -0.138918 -0.000332
N  -5.538129 0.343266 -0.000391
C  0.092682 -0.131162 -0.000036
C  1.508438 -0.339707 0.000075
C  -0.48495 1.178126 -0.000028
C  2.326547 0.869629 0.00017
C  -2.149187 -0.209699 -0.000177
C  0.338295 2.342944 0.000065
C  1.7198 2.177686 0.000167
C  -1.008937 -2.485641 -0.000225
C  2.19606 -1.596299 0.000104
C  3.594185 -1.621407 0.000215
C  4.311699 -0.386838 0.000306
H  -0.126723 3.332808 0.000071
H  2.401945 3.032302 0.000249
H  -0.507569 -2.879087 0.901303
H  -2.056018 -2.824275 -0.000369
H  -0.507351 -2.879013 -0.901662
H  1.641553 -2.538293 0.000053
H  4.140147 -2.569967 0.000237
H  5.408187 -0.382594 0.000387
