program: Gaussian 09
title: 000147859
version: EM64L-G09RevD.01
frameworkgroup: C1[X(C9H9NO4)]
method: RPBEPBE
basis: SDD
operation: Freq
keyword: #pfreq=noraman
keyword: PBEPBE/SDD
title: #p freq=noraman PBEPBE/SDD
converged: YES YES NO NO
title: Mulliken charges:
elementType: O O O O N C C C C C C C C C H H H H H H H H H
charge: -0.291159 -0.251151 -0.216768 -0.216975 0.022101 -0.051025 -0.346972 -0.322694 0.356827 -0.335643 -0.306302 0.377110 -0.332725 -0.361000 0.254449 0.224089 0.233350 0.235242 0.227270 0.263488 0.261981 0.289665 0.286842
chargesum: 0.00000
title: Mulliken charges with hydrogens summed into heavy atoms:
elementType: O O O O N C C C C C C C C C
charge: -0.291159 -0.251151 -0.216768 -0.216975 0.022101 0.203424 0.110467 0.139818 0.356827 -0.072155 -0.044321 0.377110 -0.043059 -0.074158
polarizability: 2.04700168e+02 -1.97698100e+00 1.14887819e+02 5.50554664e-01 3.31507588e-01 6.26935054e+01
1716.lowfreq: -7.2190 -4.6627 -0.0013 -0.0012 -0.0010 4.1268 32.3873 50.6974 71.6420
frequency: 32.3442 50.6802 71.6231 86.7058 100.4376 141.9901 200.3207 227.9015 297.0822 301.9266 382.0355 418.7827 429.0205 470.4104 495.7693 518.5111 620.1954 626.8730 665.0917 733.5704 736.2661 767.8223 799.9535 817.6918 820.8973 854.1884 898.5324 955.1869 974.6775 980.0555 988.4181 994.1712 1028.7115 1095.7481 1096.9461 1111.1855 1114.3023 1139.7628 1168.9535 1212.0296 1225.4755 1234.1671 1240.2145 1291.8577 1349.1730 1355.9126 1400.6017 1417.0896 1434.6653 1469.1956 1478.7587 1486.2762 1589.4814 1612.4777 2978.1063 3045.3626 3074.1333 3118.5606 3166.6755 3168.4234 3184.9684 3185.6131 3190.2671
redmass: 6.4422 4.2004 6.5866 5.9642 3.9662 5.4988 6.0763 6.3351 6.7941 5.9555 3.3462 3.1560 3.6477 5.2355 3.0424 5.6025 7.6264 7.8765 4.5256 4.8777 8.0856 8.5922 4.5075 6.4408 1.2839 1.6432 1.1913 3.9707 1.5189 1.7708 1.3398 2.9108 1.4185 2.5329 1.5319 1.2524 1.3299 1.5234 1.4078 1.3308 5.1215 2.9747 1.6427 1.2902 1.4999 5.2202 5.1323 2.2273 4.3400 1.2855 1.7559 1.3175 7.7247 6.6145 1.0558 1.1075 1.0534 1.0921 1.0883 1.0892 1.1191 1.0962 1.0972
irintensity: 1.8043 1.7207 0.6738 3.6840 0.5196 10.2181 6.4755 2.3954 0.1181 11.4796 0.6574 0.2144 2.1389 10.4810 10.1188 2.4359 6.5945 15.5013 22.7775 6.8071 6.3835 9.0740 23.1804 23.1320 6.9695 75.4633 6.9409 71.9989 25.0279 49.9347 0.5114 0.6754 0.1605 20.1491 6.2631 23.2027 15.8104 2.6819 271.6217 8.6936 483.0213 97.5878 58.8552 0.5056 15.8939 82.6110 33.3317 14.5828 15.5173 42.9658 37.9653 9.3542 40.7342 204.5783 24.7188 21.4207 21.2168 14.1540 4.8369 1.3065 27.4891 2.0964 5.0012
temp: 298.150 k
press: 1.00000 atm
elementType: 8 8 8 8 7 6 6 6 6 6 6 6 6 6 1 1 1 1 1 1 1 1 1
symmnumber: 1
zpe: 443361.3 jmol-1
zpe.correction: 0.168867 hartree
zpe.thermalcorrener: 0.181411 hartree
zpe.thermalcorrenthalpy: 0.182355 hartree
zpe.thermalcorrgfe: 0.128130 hartree
zpe.sumelectzpe: -702.828296 hartree
zpe.sumelectthermal: -702.815753 hartree
zpe.sumelectthermalent: -702.814809 hartree
zpe.sumelectthermalfe: -702.869034 hartree
dipole: -5.4335 1.2215 0.2051
dipole: 5.5729
quadrupole: -114.8956 -78.0972 -78.9596
quadrupole: -5.1631 -4.0811 0.1065
quadrupole: -24.2448 12.5536 11.6912 -5.1631 -4.0811 0.1065
hfenergy: -702.9971636 hartree
pointgroup: C01 [X(C9H9N1O4)]
dipole: 2.1376989 0.482285 0.0703719 debye
dipolederiv: -0.5972215 0.1059246 -0.0633488 0.1526428 -0.5329256 0.0168757 -0.0896322 0.0227055 -0.2912837 -2.2833844 0.1046398 -0.0908371 0.0509454 -0.296187 -0.0044882 -0.1739981 0.0098836 -0.2786227 -0.8839654 0.2030235 -0.0160097 0.335106 -0.6165086 -0.0398416 0.0000864 -0.048086 -0.2461621 -0.743523 -0.190789 -0.0737323 -0.3662158 -0.7171012 -0.1126113 -0.1100292 -0.1014779 -0.26393 2.1389686 0.0524083 0.1667573 0.1174342 1.0652506 0.1616302 0.1962707 0.1580412 0.2366072 0.3474067 0.0520487 0.036528 0.0359921 0.2106377 0.100758 0.1520497 0.0230652 0.2478104 0.1675 0.0014709 0.1286981 0.0746713 0.2517776 -0.0503046 0.0251692 0.0264838 0.2020348 1.0288899 -0.1446046 -0.0532304 -0.665231 0.3367264 -0.0856905 -0.0391543 -0.0455304 0.3055679 1.9276522 0.0126194 0.1222102 0.3921512 0.1705398 0.0312013 0.2189444 0.0069596 0.1419948 -0.666066 0.0529677 -0.0180684 0.3553542 0.0451498 0.0663067 0.0117667 0.0430582 -0.1552088 -0.5456436 -0.0796601 -0.0355835 -0.5543946 -0.0914543 -0.0201858 -0.1264188 0.0140584 -0.1996259 -1.0352744 -0.0434791 -0.089787 -0.0928016 -0.0988614 -0.0286254 -0.1114034 -0.0257358 0.0130148 0.3802346 0.0159309 0.0404111 0.3152002 0.0565251 0.0494882 0.0974908 0.0274366 -0.0834956 0.4775439 0.0023366 0.0448702 -0.2035243 0.0203126 0.001383 0.0137978 0.0174632 -0.0807204 0.0077014 -0.0150657 0.0072827 -0.0458062 0.060928 -0.0735372 0.0022481 -0.087773 -0.0625291 0.0947189 -0.0189219 -0.0978646 -0.0432521 0.0479182 0.0000558 -0.0727061 0.0310248 -0.0917632 -0.0199995 -0.1118995 -0.0251197 -0.1242627 -0.0286374 0.0314265 -0.0125853 0.0024764 0.0637642 -0.0590547 -0.0474514 0.0698304 0.099019 -0.0448776 0.0876143 0.0311346 0.0983285 -0.0192355 -0.0129198 0.0020291 -0.0250787 0.1119622 0.0131667 -0.0410134 0.0107463 -0.0840151 -0.0900282 0.0685485 -0.0567761 -0.0199919 -0.0551881 0.0019998 -0.0333351 -0.018235 -0.0341216 0.1590877 0.0136898 0.0824156 -0.0001048 0.1030855 0.0179272 -0.0206645 0.0054397 -0.0193141 0.1606354 0.0864855 0.0686416 0.0054467 0.0201533 0.0735027 -0.0149455 -0.0029367 -0.010649 0.1685322 0.107712 -0.0478092 -0.013278 -0.0130409 0.0541908 -0.0214967 -0.0080453 -0.0242823 0.1635559 unknown
polarizability: 204.4702835|1.3837081|113.7315638|5.8511424|7.7143003|64.0796448 unknown
InChI: InChI=1S/C9H9NO4/c11-10(12)7-1-3-8(4-2-7)13-5-9-6-14-9/h1-4,9H,5-6H2
charge 0 multiplicity 1
23 atoms
O  5.170795 -0.84259 0.130972
O  1.715168 0.60533 0.385356
O  -4.613097 0.863789 -0.135034
O  -4.305118 -1.369224 -0.498817
N  -3.857919 -0.180573 -0.249985
C  4.043465 0.065527 0.556497
C  4.929245 0.474019 -0.577439
C  2.67242 -0.5191 0.300737
C  0.359751 0.327448 0.218071
C  -0.505482 1.4488 0.338248
C  -0.166423 -0.963953 -0.056137
C  -2.403006 -0.004767 -0.087901
C  -1.888463 1.286684 0.18519
C  -1.55549 -1.126812 -0.209439
H  4.185644 0.537186 1.536469
H  4.560998 0.379967 -1.606511
H  5.699993 1.234374 -0.408664
H  2.423031 -1.279825 1.066744
H  2.633418 -0.985762 -0.702816
H  -0.066803 2.427814 0.550339
H  0.487532 -1.834476 -0.153269
H  -2.577551 2.130408 0.272263
H  -1.994208 -2.105464 -0.421273
