program: Gaussian 09
title: 000147926
version: EM64L-G09RevD.01
frameworkgroup: C1[X(C19H22N6O6)]
method: RPBEPBE
basis: SDD
operation: Freq
keyword: #p
keyword: freq=noraman
keyword: PBEPBE/SDD
title: #p freq=noraman PBEPBE/SDD
converged: YES YES NO NO
title: Mulliken charges:
elementType: O O O O O O N N N N N N C C C C C C C C C C C C C C C C C C C H H H H H H H H H H H H H H H H H H H H H H
charge: -0.223713 -0.230106 -0.198929 -0.193417 -0.188627 -0.187646 0.012500 0.013442 -0.653070 -0.653492 -0.363699 -0.365622 -0.359356 -0.413867 -0.418905 -0.310456 -0.322269 0.288946 0.287121 0.233884 0.232416 -0.330027 -0.332427 -0.475436 -0.475045 0.393261 0.390975 -0.399993 -0.396376 0.061697 0.064734 0.183784 0.273001 0.191767 0.236192 0.237559 0.192526 0.212214 0.223017 0.213735 0.219341 0.256510 0.258032 0.324037 0.324716 0.235119 0.233466 0.316272 0.315575 0.315724 0.317321 0.215855 0.217738
chargesum: 0.00000
title: Mulliken charges with hydrogens summed into heavy atoms:
elementType: O O O O O O N N N N N N C C C C C C C C C C C C C C C C C C C
charge: -0.223713 -0.230106 -0.198929 -0.193417 -0.188627 -0.187646 0.012500 0.013442 -0.021223 -0.020446 -0.147844 -0.147884 0.097428 0.014093 0.011180 0.124775 0.110807 0.288946 0.287121 0.233884 0.232416 -0.073517 -0.074395 -0.151400 -0.150329 0.393261 0.390975 -0.164874 -0.162910 0.061697 0.064734
polarizability: 3.48998952e+02 -3.47153911e+01 3.18620610e+02 -1.25274933e+01 -8.54716744e+00 2.16662483e+02
1716.lowfreq: -5.2451 -1.7246 -0.6820 0.0001 0.0006 0.0009 6.9149 9.7304 10.5212
frequency: 6.8943 9.7198 10.4637 23.7641 30.5974 40.7568 49.2558 51.6456 53.4150 60.3164 83.5257 95.7115 100.3948 113.7507 125.3450 133.6242 147.8489 149.0176 151.2306 158.7594 207.1088 221.8442 250.3662 254.2140 268.5131 281.7681 282.1503 320.7013 327.1154 354.2074 365.6280 373.7078 380.4166 409.6881 412.3810 439.6639 441.0533 456.5884 456.8504 469.5315 471.6560 478.8270 492.7660 531.1253 532.1795 551.2712 553.0140 589.4557 595.4970 645.8532 646.5840 669.2564 670.4472 695.1850 700.0353 714.7545 717.0427 733.4178 745.9605 746.7547 751.4198 775.5315 808.3120 808.9612 820.9111 823.9902 827.9315 866.4222 871.4368 893.7022 920.1481 929.8766 945.4318 946.7439 956.6575 959.0950 961.1990 1011.7147 1041.4254 1041.6671 1055.8653 1062.8893 1063.4383 1072.3935 1072.8825 1087.9158 1103.1582 1121.4663 1140.3474 1141.0283 1167.7616 1170.3702 1174.9652 1207.4867 1213.6670 1215.3908 1232.0136 1245.0259 1246.0979 1265.9193 1267.6064 1277.4425 1294.4664 1310.0224 1346.3806 1347.3837 1353.4390 1366.0466 1369.6683 1371.3252 1373.2862 1378.1168 1389.7447 1390.5190 1423.1191 1423.2766 1450.0652 1455.2529 1470.5122 1471.0828 1480.9969 1499.6914 1500.7963 1561.8801 1562.0428 1602.7994 1602.8945 1621.9867 1623.1601 1637.5446 1638.2819 2956.4214 2961.3565 2972.1542 2979.3101 2984.2579 3020.1703 3028.5900 3042.1687 3046.2335 3075.3865 3135.7079 3135.7455 3172.9108 3173.5024 3180.7184 3183.0637 3333.4619 3335.8876 3530.5766 3532.2249 3674.9265 3676.1082
redmass: 7.4540 7.8499 8.3058 6.1664 7.7471 11.9454 5.7173 5.9992 7.3671 4.8730 4.3078 3.6655 3.2808 4.4817 4.5821 4.6292 5.3816 6.3842 5.1641 4.4947 4.0746 2.0786 4.5156 4.2592 3.0952 5.8002 5.9956 4.9913 5.2729 6.4124 4.9100 5.8230 4.5957 1.1383 1.1386 4.1127 4.0824 1.2328 1.2394 3.3745 3.6746 3.7418 3.4620 3.2033 3.2985 3.9934 3.9193 4.2333 4.0819 6.5837 6.5146 5.0737 5.0132 3.0003 4.1849 3.9493 5.0293 2.3182 4.2294 4.3654 4.0670 3.0508 1.4813 1.4589 1.6390 1.4341 1.7273 5.0087 3.3548 2.4745 3.5620 2.4332 1.5221 1.5222 1.9545 1.3747 1.5025 2.7216 1.6625 1.6882 2.1169 2.0979 2.0720 1.8525 1.9355 2.0365 2.4841 2.0578 2.2519 2.2226 1.4690 1.4911 1.2405 1.3123 6.1978 9.6709 1.2537 2.6326 2.5362 1.6235 1.6939 1.2510 1.1707 1.1395 3.6308 3.4235 1.4063 1.4402 1.6125 6.9678 7.6285 1.7544 4.1597 3.7498 4.6620 4.5750 1.0807 1.0771 1.1754 1.1716 1.1096 2.6481 2.7500 7.5497 7.5223 2.9225 2.8997 6.7054 6.7244 1.4876 1.4657 1.0551 1.0554 1.0671 1.0638 1.0629 1.1057 1.1058 1.0951 1.1016 1.0996 1.0892 1.0892 1.0936 1.0936 1.0924 1.0922 1.0764 1.0765 1.0452 1.0452 1.1033 1.1033
irintensity: 1.4587 4.8696 4.4284 1.1299 2.3581 0.7039 2.0992 2.9258 4.8465 5.6500 1.0679 0.6165 1.7761 0.5215 0.8154 1.2069 0.4798 0.1954 0.2942 0.9219 2.4150 3.8088 12.3464 11.0929 3.1726 4.0191 10.7528 1.1473 0.6031 8.4672 2.1068 1.0252 4.8119 83.3627 73.8828 5.2442 1.0580 105.1214 261.7431 7.9347 25.9443 22.5931 9.0455 15.1667 5.2390 13.3118 15.2508 19.6266 25.6372 6.9659 2.0833 6.0956 4.2601 7.5502 31.2278 2.5432 1.3703 22.0622 14.3268 5.2752 9.3065 3.9455 15.8837 17.0472 87.1726 96.3533 41.6535 12.8421 5.6598 9.5815 60.0383 32.3725 31.2445 14.2934 38.7546 17.9253 5.1128 38.6736 4.7981 4.1617 33.9170 115.5928 172.8128 19.4885 12.7430 5.4250 5.8894 4.1025 3.0322 3.2757 36.7386 56.1948 10.6839 29.5922 213.3887 227.6084 10.6009 155.5167 108.8500 183.7246 101.8809 7.5630 2.8879 15.0853 45.7025 41.9869 11.8593 58.2474 7.0540 125.6124 249.4684 8.8240 85.4820 29.3783 13.9442 11.3832 5.9589 6.6709 55.7387 59.3838 27.4920 101.2886 157.8598 30.7001 15.9678 37.1351 70.2785 155.4257 108.4063 180.8686 189.7955 27.3105 26.7786 20.2176 38.8923 52.8968 25.7813 47.3008 44.6909 2.9966 43.6726 19.0016 6.7320 6.2107 7.8896 12.6029 12.6472 25.9415 25.4047 20.5795 22.4161 18.3464 18.9796
temp: 298.150 k
press: 1.00000 atm
elementType: 8 8 8 8 8 8 7 7 7 7 7 7 6 6 6 6 6 6 6 6 6 6 6 6 6 6 6 6 6 6 6 1 1 1 1 1 1 1 1 1 1 1 1 1 1 1 1 1 1 1 1 1 1
symmnumber: 1
zpe: 1059083.8 jmol-1
zpe.correction: 0.403384 hartree
zpe.thermalcorrener: 0.434081 hartree
zpe.thermalcorrenthalpy: 0.435025 hartree
zpe.thermalcorrgfe: 0.334782 hartree
zpe.sumelectzpe: -1514.586607 hartree
zpe.sumelectthermal: -1514.555910 hartree
zpe.sumelectthermalent: -1514.554966 hartree
zpe.sumelectthermalfe: -1514.655209 hartree
dipole: -6.0375 5.3611 -8.3967
dipole: 11.6489
quadrupole: -97.8386 -163.1138 -187.0110
quadrupole: -24.8950 -44.8016 3.0516
quadrupole: 51.4825 -13.7927 -37.6899 -24.8950 -44.8016 3.0516
hfenergy: -1514.9899911 hartree
pointgroup: C01 [X(C19H22N6O6)]
dipole: 2.3734881 1.5433249 3.6040098 debye
polarizability: 352.1775927|34.0811793|311.5166743|-4.2838781|22.8240509|220.5877787 unknown
InChI: InChI=1S/C19H22N6O6/c20-18(21)12-4-6-16(14(10-12)24(26)27)30-8-2-1-3-9-31-17-7-5-13(19(22)23)11-15(17)25(28)29/h4-7,10-11,20,22H,1-3,8-9,21,23H2
charge 0 multiplicity 1
53 atoms
O  -2.598535 1.926365 0.380745
O  2.621019 1.416864 0.140527
O  -3.260889 -0.221105 -2.991262
O  2.038362 -2.376193 -1.048628
O  -2.99944 1.935954 -2.30216
O  1.147368 -0.868039 0.411245
N  -3.365639 0.71576 -2.105739
N  2.139503 -1.374517 -0.238296
N  -6.969331 -2.76686 1.458684
N  8.277589 -1.796317 0.019871
N  -7.279817 -2.309838 -0.904673
N  6.674246 -3.575202 0.40998
C  0.280317 2.711128 1.176976
C  -1.032741 3.522236 1.261533
C  1.39093 3.478872 0.425803
C  -2.243492 2.65727 1.622301
C  2.770757 2.830885 0.559157
C  -3.63066 1.009565 0.409546
C  3.706062 0.569359 0.239993
C  -3.993173 0.356634 -0.811611
C  3.496939 -0.823022 -0.011041
C  -4.334328 0.640519 1.58565
C  5.028854 0.994407 0.528251
C  -4.97319 -0.649455 -0.83795
C  4.567034 -1.73188 -0.029887
C  -5.654867 -1.023711 0.341319
C  5.884636 -1.297279 0.239403
C  -5.329471 -0.35484 1.548217
C  6.095206 0.074008 0.531973
C  -6.70024 -2.094141 0.258914
C  6.990125 -2.309471 0.224371
H  0.625767 2.458153 2.201085
H  0.100979 1.752004 0.660605
H  -0.935208 4.329838 2.014968
H  -1.248164 4.009154 0.291059
H  1.120735 3.553599 -0.644587
H  1.475924 4.516166 0.811793
H  -1.996831 1.932559 2.425138
H  -3.113957 3.269212 1.932677
H  3.124968 2.85016 1.610579
H  3.517176 3.332931 -0.089389
H  -4.105947 1.131806 2.534823
H  5.229042 2.046363 0.747452
H  -5.229394 -1.142997 -1.779157
H  4.389772 -2.791777 -0.231735
H  -5.878715 -0.580021 2.469435
H  7.094143 0.434445 0.802449
H  -6.332953 -2.70956 2.251073
H  -7.695094 -3.48023 1.487527
H  8.423574 -0.851513 -0.329178
H  9.081125 -2.421037 0.039243
H  -7.964384 -3.093511 -0.894542
H  7.484406 -4.225201 0.34997
