program: Gaussian 09
title: 000147934
version: EM64L-G09RevD.01
frameworkgroup: C1[X(C19H28N8)]
method: RPBEPBE
basis: SDD
operation: Freq
keyword: #pfreq=noraman
keyword: PBEPBE/SDD
title: #p freq=noraman PBEPBE/SDD
converged: YES YES NO NO
title: Mulliken charges:
elementType: N N N N N N N N C C C C C C C C C C C C C C C C C C C H H H H H H H H H H H H H H H H H H H H H H H H H H H H
charge: -0.402519 -0.441689 -0.705662 -0.677967 -0.710145 -0.657581 -0.420366 -0.476445 -0.339621 -0.380681 -0.439050 -0.471917 -0.376504 0.292940 0.319500 0.211091 0.241190 -0.367387 -0.385622 -0.570876 -0.525079 0.385136 0.436263 -0.378199 -0.456856 0.026186 0.104581 0.189303 0.202022 0.191211 0.254226 0.204520 0.206014 0.222924 0.214474 0.213035 0.216981 0.295717 0.292863 0.227225 0.227669 0.291298 0.276224 0.251925 0.225976 0.289974 0.299311 0.294836 0.318466 0.276515 0.442057 0.307655 0.324191 0.195340 0.215324
chargesum: 0.00000
title: Mulliken charges with hydrogens summed into heavy atoms:
elementType: N N N N N N N N C C C C C C C C C C C C C C C C C C C
charge: -0.106802 -0.148826 -0.116376 -0.064665 0.008427 -0.025736 -0.225026 -0.261120 0.051704 0.064756 -0.028515 -0.034520 0.053512 0.292940 0.319500 0.211091 0.241190 -0.140162 -0.157952 -0.279577 -0.248855 0.385136 0.436263 -0.126273 -0.230880 0.026186 0.104581
polarizability: 3.75285370e+02 1.33177673e+01 2.77595483e+02 1.13876937e+01 -4.66854549e+01 1.89786110e+02
1716.lowfreq: -10.3666 0.0002 0.0003 0.0007 3.7476 4.2446 21.3759 33.9770 42.7066
frequency: 21.0231 33.8936 42.6471 52.8195 67.3585 78.1963 78.5014 99.0917 106.0848 113.6649 127.6326 139.1937 154.9372 183.3933 192.5098 201.8171 207.2892 212.6798 221.7949 247.6296 251.8234 274.1878 286.7851 302.0475 318.2743 326.7132 334.6351 357.5291 362.2765 435.5447 439.9548 445.0922 450.7232 456.0509 460.9855 474.9543 484.4295 517.5856 520.8561 525.5669 541.2147 553.7382 565.9121 567.4202 574.6012 592.0084 603.9864 613.6816 666.7921 674.3585 688.5369 693.6138 703.6807 722.6868 725.2936 740.0174 743.2885 755.1595 773.0694 786.7280 790.2691 801.2627 815.7896 829.7700 839.7182 870.7923 890.1173 905.3921 908.8918 919.1648 928.7536 931.8885 937.5610 940.9916 995.6276 1026.2284 1045.4417 1046.0851 1070.3163 1073.2485 1084.0182 1096.3565 1107.3726 1108.5985 1117.0623 1119.9968 1122.5619 1147.9788 1158.7966 1165.0444 1182.8255 1201.7076 1227.9274 1239.0363 1252.6066 1267.6223 1282.6241 1286.4282 1295.0401 1316.3499 1321.4276 1325.1175 1346.2037 1350.6764 1360.5119 1368.6111 1381.8735 1383.8151 1401.2434 1412.7443 1454.9230 1455.6430 1461.8638 1464.3861 1466.4299 1470.0989 1472.1147 1474.9545 1488.4214 1522.5263 1528.8306 1557.3651 1578.4569 1593.0114 1595.1351 1617.2937 1620.3722 1627.9597 1644.6450 1656.9448 1691.8136 2926.3714 2958.1795 2968.4964 2974.3310 2984.4131 3007.4677 3023.8024 3036.4897 3043.9179 3060.2112 3125.4179 3131.6101 3133.3861 3143.1457 3148.1591 3153.3666 3156.7282 3309.2832 3327.9344 3456.8922 3458.9193 3487.0076 3524.4530 3532.5957 3577.9273 3588.7257 3597.6688 3679.7729
redmass: 5.0484 5.2973 4.7135 4.7477 4.7102 4.8842 4.5681 4.9103 3.9354 5.1271 4.0652 2.5225 2.1243 2.5865 2.7186 3.7461 3.0455 3.1001 2.7593 2.3054 2.7700 1.9137 1.8974 3.4529 3.6727 3.8881 3.5708 4.0414 3.4091 2.0849 1.5018 2.8959 2.9229 1.2566 2.2942 1.8668 1.7516 2.2525 3.1860 4.5351 2.0200 2.4781 2.3849 2.8575 3.5348 2.9611 3.5052 1.4104 2.0097 2.6768 2.7920 3.6891 2.3570 1.6188 1.6626 3.8905 2.6673 2.2245 1.3693 1.8393 2.1313 1.4734 1.4312 1.7047 2.5197 1.3139 2.3122 1.5086 1.4019 2.0128 1.4019 2.9550 3.2676 1.3484 1.6894 2.0931 1.6123 1.9995 1.9922 1.5819 2.1988 1.6958 1.8753 1.8191 1.8569 2.0173 2.1516 1.3764 1.4649 1.4976 1.3887 1.2714 1.7127 1.8606 1.4409 1.3608 1.4779 1.3114 1.3737 1.4702 1.9489 1.6714 1.4337 1.3235 1.3528 1.4791 3.6591 3.7378 3.5238 3.6716 1.5174 1.1158 2.8658 1.7755 3.8370 1.1326 1.2326 1.2015 1.0936 3.6734 3.9992 4.6965 5.3294 4.1232 4.9358 2.9121 3.5319 1.3295 1.4489 1.2838 1.1804 1.0701 1.0600 1.0643 1.0621 1.0614 1.0980 1.0963 1.1016 1.0934 1.0998 1.0869 1.0908 1.0868 1.0785 1.0903 1.0949 1.0954 1.0752 1.0747 1.0475 1.0480 1.0752 1.0758 1.0450 1.0813 1.0961 1.0961 1.1039
irintensity: 0.4835 1.8430 0.0647 0.3775 1.9481 1.0596 6.3801 3.1902 3.9591 4.6356 1.6788 5.6128 3.0432 5.0821 12.3234 8.8564 1.2985 2.1572 0.4981 16.2377 2.5612 5.8670 26.3487 6.6263 3.6937 1.1662 3.2655 0.2775 2.3679 42.8247 164.0975 10.2734 7.8488 20.6671 64.8193 27.4620 44.1516 50.7279 3.6295 24.1596 35.8237 38.0188 25.2440 11.7626 3.5503 97.4050 13.9142 103.3292 49.9972 59.0125 37.7412 38.9851 104.1971 91.3799 117.0602 11.2956 62.0278 8.6362 63.0931 55.8141 64.1776 61.4151 72.6129 5.6302 1.7485 169.0679 8.5994 7.9636 1.6367 5.7002 46.0417 0.2553 9.0833 11.0669 0.4098 2.2345 11.5916 18.4299 9.3608 3.2322 10.1116 68.2477 72.9624 2.4520 49.1573 54.3632 7.7914 83.7279 61.2294 13.1442 15.0831 13.3853 8.3128 12.6966 28.4976 3.1379 10.3202 13.3013 5.5957 22.9053 42.4220 47.3379 6.8833 6.9346 3.9229 19.3952 181.5416 25.9848 109.8160 104.7995 44.9432 1.6514 92.3098 25.1385 130.3734 15.1618 6.2909 3.4884 23.7397 143.7156 297.3027 46.5637 102.0517 48.5296 113.6338 36.3081 137.6301 248.9081 106.4959 74.1552 196.0112 90.0757 30.2384 32.6450 88.3056 89.0792 12.0715 31.0727 12.4087 50.0732 85.2124 11.0967 33.8974 65.2228 752.5936 40.8341 16.8082 6.8497 35.6189 20.8880 3.4094 6.8350 19.9982 23.0334 26.9900 17.0444 13.2262 12.7503 15.6517
temp: 298.150 k
press: 1.00000 atm
elementType: 7 7 7 7 7 7 7 7 6 6 6 6 6 6 6 6 6 6 6 6 6 6 6 6 6 6 6 1 1 1 1 1 1 1 1 1 1 1 1 1 1 1 1 1 1 1 1 1 1 1 1 1 1 1 1
symmnumber: 1
zpe: 1213332.3 jmol-1
zpe.correction: 0.462134 hartree
zpe.thermalcorrener: 0.489302 hartree
zpe.thermalcorrenthalpy: 0.490247 hartree
zpe.thermalcorrgfe: 0.405787 hartree
zpe.sumelectzpe: -1176.835640 hartree
zpe.sumelectthermal: -1176.808472 hartree
zpe.sumelectthermalent: -1176.807528 hartree
zpe.sumelectthermalfe: -1176.891987 hartree
dipole: -2.5345 -5.4748 1.1286
dipole: 6.1377
quadrupole: -119.9412 -158.0776 -164.0678
quadrupole: -20.2099 7.0711 -9.2688
quadrupole: 27.4210 -10.7154 -16.7056 -20.2099 7.0711 -9.2688
hfenergy: -1177.2977741 hartree
pointgroup: C01 [X(C19H28N8)]
dipole: 1.1293982 1.9613459 0.8417522 debye
polarizability: 375.3567484|13.3500465|252.6074377|-14.1284977|60.5562222|214.7027771 unknown
InChI: InChI=1S/C19H28N8/c20-14-10-12(18(22)23)4-6-16(14)26-8-2-1-3-9-27-17-7-5-13(19(24)25)11-15(17)21/h4-7,10-11,22,24,26-27H,1-3,8-9,20-21,23,25H2
charge 0 multiplicity 1
55 atoms
N  2.823635 -2.127858 0.646103
N  1.905944 2.332383 -0.901252
N  2.053902 -3.697143 -1.460315
N  0.064596 0.571237 -1.992587
N  -3.695074 -1.696793 -0.216687
N  -3.951612 3.099221 1.909344
N  -3.010737 -3.46346 -1.713778
N  -3.949015 0.785338 1.237877
C  4.153217 0.528033 -0.066228
C  3.482761 0.255646 1.299181
C  4.341883 2.028544 -0.408395
C  3.437387 -1.258313 1.657697
C  3.071057 2.895903 -0.21666
C  1.444146 -2.196789 0.383668
C  0.601777 2.349721 -0.390033
C  1.031638 -3.018275 -0.724874
C  -0.353979 1.427311 -0.948614
C  0.440411 -1.545874 1.146378
C  0.197926 3.182971 0.685341
C  -0.325373 -3.096869 -1.074492
C  -1.660012 1.384859 -0.428773
C  -1.324673 -2.401047 -0.339136
C  -2.04732 2.195658 0.668547
C  -0.925296 -1.649354 0.793484
C  -1.106116 3.101515 1.220017
C  -2.748298 -2.541309 -0.790652
C  -3.386675 1.986943 1.284351
H  5.147378 0.034296 -0.099655
H  3.540092 0.049621 -0.855132
H  4.032132 0.78239 2.107581
H  2.453519 0.658367 1.287782
H  5.136365 2.465355 0.230082
H  4.700552 2.118639 -1.454664
H  2.901897 -1.394943 2.616387
H  4.47188 -1.62145 1.8173
H  3.289378 3.93755 -0.542311
H  2.832688 2.945292 0.860844
H  3.407467 -2.372219 -0.159766
H  2.018416 2.030346 -1.871383
H  0.720525 -0.928573 2.006058
H  0.905663 3.902948 1.108877
H  -0.66785 -3.724526 -1.905867
H  -2.378392 0.664264 -0.832665
H  -1.667006 -1.128089 1.407719
H  -1.358058 3.703418 2.100705
H  2.694942 -4.272696 -0.904271
H  1.739635 -4.157463 -2.316879
H  0.99021 0.14699 -1.870407
H  -0.632578 -0.106114 -2.311057
H  -4.664632 -1.822802 -0.50924
H  -3.522466 -0.857997 0.379522
H  -4.816017 3.018866 2.440858
H  -3.549661 4.024204 1.775442
H  -4.016814 -3.47811 -1.983807
H  -4.895364 0.757237 1.66893
