program: Gaussian 09
title: 000147801
version: EM64L-G09RevD.01
frameworkgroup: C1[X(C14H14N2O2)]
method: RPBEPBE
basis: SDD
operation: Freq
keyword: #p
keyword: freq=noraman
keyword: PBEPBE/SDD
title: #p freq=noraman PBEPBE/SDD
converged: YES YES NO NO
title: Mulliken charges:
elementType: O O N N C C C C C C C C C C C C C C H H H H H H H H H H H H H H
charge: -0.176992 -0.266816 0.013836 -0.294969 0.364987 0.319224 0.330699 -0.462523 -0.017783 -0.519947 -0.823895 -0.394940 -0.393953 -0.231401 -0.238212 -0.242426 0.294661 -0.742870 0.250159 0.255758 0.232346 0.247834 0.235485 0.240135 0.235081 0.226274 0.225556 0.331672 0.229893 0.253534 0.252798 0.266795
chargesum: 0.00000
title: Mulliken charges with hydrogens summed into heavy atoms:
elementType: O O N N C C C C C C C C C C C C C C
charge: -0.176992 -0.266816 0.013836 0.036703 0.364987 0.319224 0.330699 -0.212364 -0.017783 -0.264189 -0.108230 -0.154805 -0.158871 -0.005127 -0.012656 -0.012533 0.294661 0.030256
polarizability: 3.22086262e+02 5.66590843e+00 1.69821056e+02 -3.89108505e-02 -3.04946322e+00 8.94969321e+01
1716.lowfreq: -3.1442 -0.0008 -0.0006 -0.0004 0.9116 6.2171 24.0802 36.6688 59.4732
frequency: 24.0544 36.6168 59.4623 65.2473 66.6983 76.0178 113.3274 152.0689 179.8421 209.3205 221.2344 243.3248 263.1813 293.9166 341.7093 385.6487 405.8798 408.2233 442.3125 496.6446 509.9978 533.5425 554.0105 582.5567 596.4243 617.7815 618.7886 653.2011 687.1511 701.6793 752.0365 771.7675 794.9208 849.1220 880.6725 899.3873 916.2579 919.1740 929.0507 967.7924 973.9023 987.1981 991.5410 994.2997 999.2948 1025.5085 1043.2585 1045.8124 1063.3460 1083.6905 1131.4885 1173.5304 1182.3233 1193.8398 1244.6571 1299.0797 1305.3563 1321.2652 1338.4746 1367.9531 1388.1064 1393.3503 1403.7220 1408.4873 1439.4917 1451.6468 1455.4352 1456.0538 1469.8647 1482.3274 1501.0155 1531.1384 1584.1241 1604.1697 1613.4307 1653.4548 2959.7809 3009.4828 3034.2419 3088.9074 3099.2822 3121.9993 3124.7166 3129.9088 3131.9256 3139.2363 3140.3424 3148.6790 3165.0806 3360.1845
redmass: 6.5201 4.5108 3.7838 2.2106 4.2971 1.5904 3.8567 4.4596 1.1166 7.6504 3.5615 3.1827 4.2080 4.0794 5.3333 4.4264 2.8461 3.8006 4.0146 3.7166 4.8554 3.5711 3.2784 3.4192 3.4633 5.6576 6.1635 2.4001 7.0013 1.7189 4.3172 1.9736 4.8185 1.2549 5.6177 1.4242 2.7297 1.5182 1.6491 4.5767 1.4287 3.4078 1.8973 1.3727 2.1525 2.4786 1.5798 1.5164 2.1823 1.6179 3.4732 1.0521 3.5188 1.1207 1.7714 3.5611 1.8524 1.5621 2.6315 4.8521 1.3890 2.0524 1.5429 1.6490 2.3485 2.1216 1.0655 1.0847 1.0888 1.2530 2.2112 5.7949 6.1117 6.0211 6.1157 8.2149 1.0404 1.0365 1.0951 1.0974 1.0973 1.0849 1.0889 1.0894 1.0919 1.1011 1.0921 1.0963 1.1017 1.0762
irintensity: 0.0981 2.0430 1.9332 0.3472 3.3893 0.0807 3.6645 1.2654 1.5801 1.7547 0.5502 0.6943 8.1080 12.0355 1.3045 10.8010 0.6130 17.8744 2.6741 17.0476 23.7273 20.7404 39.0880 90.4809 19.7916 3.8190 3.0245 78.6583 8.0043 49.3936 4.5391 69.7888 19.9321 0.1407 75.4054 17.4247 44.7743 13.3916 5.3554 15.9406 0.4278 3.7280 7.2051 2.0773 16.7325 5.1459 22.1811 7.4555 1.4715 7.5224 10.5820 0.0380 391.0782 1.0693 5.6292 31.1089 15.2011 7.5708 4.1625 16.3267 28.6116 48.3923 16.3473 11.9663 6.1532 301.2932 15.4518 41.1401 35.9464 5.3246 22.6958 26.5792 3.7647 122.7547 3.4543 224.4322 28.8919 3.4756 17.1076 15.5377 4.7015 9.7257 8.4521 6.8753 17.0100 4.5655 9.1084 41.8014 28.8149 96.8060
temp: 298.150 k
press: 1.00000 atm
elementType: 8 8 7 7 6 6 6 6 6 6 6 6 6 6 6 6 6 6 1 1 1 1 1 1 1 1 1 1 1 1 1 1
symmnumber: 1
zpe: 654808.6 jmol-1
zpe.correction: 0.249403 hartree
zpe.thermalcorrener: 0.266193 hartree
zpe.thermalcorrenthalpy: 0.267137 hartree
zpe.thermalcorrgfe: 0.203002 hartree
zpe.sumelectzpe: -800.519183 hartree
zpe.sumelectthermal: -800.502394 hartree
zpe.sumelectthermalent: -800.501450 hartree
zpe.sumelectthermalfe: -800.565585 hartree
dipole: -0.3926 0.5643 0.6842
dipole: 0.9699
quadrupole: -90.1510 -92.8804 -111.5835
quadrupole: -8.1641 -2.0655 -3.6111
quadrupole: 8.0539 5.3246 -13.3785 -8.1641 -2.0655 -3.6111
hfenergy: -800.7685866 hartree
pointgroup: C01 [X(C14H14N2O2)]
dipole: -0.1534359 -0.3163863 -0.1481785 debye
polarizability: 322.0915198|-4.6644998|152.6270955|3.1075984|-33.0804103|106.685635 unknown
InChI: InChI=1S/C14H14N2O2/c1-10-8-13(12-6-4-3-5-7-12)9-15-14(10)16-18-11(2)17/h3-9,16H,1-2H3
charge 0 multiplicity 1
32 atoms
O  3.693416 0.834892 0.240463
O  5.206564 -0.775581 -0.508763
N  0.988226 0.99962 0.154287
N  2.910547 -0.309408 0.709128
C  -1.249248 -0.018894 0.156087
C  0.73744 -1.396006 0.674882
C  -2.71652 0.13276 -0.029022
C  -0.651415 -1.265509 0.502504
C  1.520051 -0.208814 0.472823
C  -0.362662 1.078272 0.006435
C  1.389126 -2.710698 1.049134
C  -3.242109 1.051898 -0.980154
C  -3.636463 -0.63541 0.738624
C  -4.634443 1.202592 -1.152061
C  -5.028891 -0.490833 0.562221
C  -5.536355 0.430743 -0.383282
C  4.906608 0.433422 -0.366653
C  5.712504 1.646088 -0.750659
H  -1.280368 -2.156432 0.615064
H  -0.748134 2.079351 -0.218912
H  2.100839 -3.058279 0.272312
H  1.956166 -2.622947 1.995868
H  0.633713 -3.503608 1.177202
H  -2.555549 1.630723 -1.608236
H  -3.25968 -1.32741 1.500802
H  -5.015659 1.913147 -1.894126
H  -5.718212 -1.088137 1.169695
H  3.404187 -1.18035 0.443974
H  -6.617474 0.545102 -0.518812
H  6.644777 1.671032 -0.159388
H  5.993673 1.573766 -1.814817
H  5.143643 2.57071 -0.575817
