program: Gaussian 09
title: 000147727
version: EM64L-G09RevD.01
frameworkgroup: C1[X(C14H16O)]
method: RPBEPBE
basis: SDD
operation: Freq
keyword: #pfreq=noraman
keyword: PBEPBE/SDD
title: #p freq=noraman PBEPBE/SDD
converged: YES YES NO NO
title: Mulliken charges:
elementType: O C C C C C C C C C C C C C C H H H H H H H H H H H H H H H H
charge: -0.303085 0.148393 -0.159471 -0.109475 -0.437909 -0.453714 0.270357 -0.489928 -0.437186 -0.570219 0.322551 -0.359683 -0.397405 -0.264932 -0.245926 0.203379 0.207679 0.228203 0.204466 0.199789 0.226984 0.235298 0.206934 0.211187 0.204641 0.230607 0.222040 0.221145 0.231518 0.226474 0.227289
chargesum: 0.00000
title: Mulliken charges with hydrogens summed into heavy atoms:
elementType: O C C C C C C C C C C C C C C
charge: -0.303085 0.148393 0.043908 0.098204 -0.005240 -0.026941 0.270357 -0.047696 -0.021359 -0.117572 0.322551 -0.138538 -0.165888 -0.038459 -0.018636
polarizability: 1.86614875e+02 1.69531823e+00 1.52561348e+02 -2.71420261e+00 -3.73207786e-02 9.11201831e+01
1716.lowfreq: -10.0851 -0.0007 -0.0006 0.0003 5.5805 11.9202 39.5399 86.1335 155.9337
frequency: 39.3746 86.1158 155.9295 188.9271 207.1902 218.1756 276.9662 307.4626 351.2802 360.1418 384.3309 429.7561 463.0865 471.0880 490.0172 545.5853 565.9696 588.5384 631.5119 646.5484 710.4926 728.3901 760.4001 781.9756 810.2377 822.9467 857.7557 866.7906 873.1416 891.5629 941.3454 951.8516 968.6890 986.6712 987.9986 1016.6217 1041.6792 1051.6248 1075.3121 1090.0066 1095.8217 1121.8312 1140.1535 1158.0564 1177.2656 1179.3728 1191.7240 1203.5029 1227.8514 1241.7779 1259.8053 1283.0652 1287.9739 1296.4591 1330.0641 1335.0741 1341.0103 1349.3058 1354.2263 1361.7914 1379.1522 1406.2613 1443.0445 1453.6306 1454.2838 1458.0510 1471.6803 1473.6252 1491.3855 1583.5098 1615.7694 2931.2262 2953.3775 2971.3838 2983.1917 2986.2151 2989.6795 3024.2095 3028.5613 3042.9421 3048.1333 3055.5768 3078.4651 3113.7541 3130.6267 3146.8869 3163.3837
redmass: 3.3382 3.8890 2.4045 2.5382 3.3471 3.5557 2.0621 2.8850 5.4422 4.5191 3.8372 2.7920 3.3318 3.0842 3.2866 3.5423 3.5160 3.3572 3.4584 3.5989 3.6554 2.0371 2.2800 2.4664 3.2833 1.8773 1.8886 1.9150 1.9986 2.0112 1.7498 1.6850 2.7564 1.4074 1.9995 2.1907 1.7866 1.8266 1.9849 2.1670 2.0545 1.5061 1.8340 1.3876 1.0805 1.3879 1.3680 2.0465 1.6232 1.8637 1.2618 1.3773 1.3638 1.3017 1.5041 1.5381 1.5227 1.4923 1.6884 1.8088 5.1377 2.6414 2.3757 1.1192 1.1216 1.0879 1.0949 1.0906 2.3976 6.7062 6.3490 1.0810 1.0658 1.0620 1.0621 1.0610 1.0617 1.0931 1.0967 1.1014 1.1035 1.1024 1.0892 1.0872 1.0877 1.0931 1.0997
irintensity: 0.3464 0.5841 2.3775 1.8846 2.2433 1.5773 1.0320 1.5747 6.8882 1.3786 0.8984 2.5547 1.1006 7.6900 0.7423 10.6406 4.3826 1.3408 1.7413 10.1987 11.6105 30.2778 37.7089 20.7003 8.0188 9.6046 11.9501 2.1884 10.5974 7.1783 2.0872 2.6527 1.6957 1.2458 6.8220 3.0762 6.0295 0.5541 1.7141 1.6434 4.7783 1.0428 1.6899 1.5969 0.6575 1.7828 0.0916 1.2789 2.8849 12.0942 0.6710 2.4960 7.6524 2.8948 0.1464 2.3061 0.9409 0.9898 0.8034 4.2163 1.3415 3.1871 6.7046 3.6269 13.7000 9.1381 14.4129 9.3491 17.8712 0.5682 2.5051 19.8408 26.0233 30.9674 47.5960 5.5046 66.1419 39.8731 35.6637 25.5443 29.7853 67.3113 38.2807 10.3082 5.8220 33.1866 28.9916
temp: 298.150 k
press: 1.00000 atm
elementType: 8 6 6 6 6 6 6 6 6 6 6 6 6 6 6 1 1 1 1 1 1 1 1 1 1 1 1 1 1 1 1
symmnumber: 1
zpe: 690470.3 jmol-1
zpe.correction: 0.262986 hartree
zpe.thermalcorrener: 0.274944 hartree
zpe.thermalcorrenthalpy: 0.275888 hartree
zpe.thermalcorrgfe: 0.225136 hartree
zpe.sumelectzpe: -617.192179 hartree
zpe.sumelectthermal: -617.180221 hartree
zpe.sumelectthermalent: -617.179277 hartree
zpe.sumelectthermalfe: -617.230029 hartree
dipole: -0.3020 0.6579 -2.1787
dipole: 2.2959
quadrupole: -80.9884 -80.7600 -95.8223
quadrupole: 0.9212 2.2479 2.0682
quadrupole: 4.8685 5.0969 -9.9654 0.9212 2.2479 2.0682
hfenergy: -617.4551649 hartree
pointgroup: C01 [X(C14H16O1)]
dipole: -0.1122207 0.2431345 -0.8626531 debye
polarizability: 186.6407987|1.8076756|152.5560625|-1.8896232|-1.1192191|91.0995451 unknown
InChI: InChI=1S/C14H16O/c1-2-6-12-10(4-1)8-9-11-5-3-7-13-14(11,12)15-13/h1-2,4,6,11,13H,3,5,7-9H2
charge 0 multiplicity 1
31 atoms
O  -1.197353 -0.893064 1.41922
C  -0.660702 -0.284504 0.105165
C  -1.521003 -1.520971 0.079105
C  -1.310369 1.05179 -0.27094
C  -2.995843 -1.491947 -0.314026
C  -2.828411 1.049523 0.004411
C  0.84065 -0.333449 -0.014513
C  -0.543856 2.191992 0.433724
C  -3.511785 -0.101154 -0.766946
C  0.903883 2.246032 -0.0950
C  1.586877 0.880411 -0.094425
C  1.540221 -1.56897 0.013144
C  3.000498 0.816495 -0.176852
C  2.945059 -1.61898 -0.069338
C  3.683267 -0.416279 -0.17175
H  -1.0309 -2.495573 -0.053622
H  -1.167758 1.173949 -1.369288
H  -3.567588 -1.842145 0.567965
H  -3.166749 -2.234989 -1.117198
H  -3.254871 2.022116 -0.309264
H  -3.003952 0.938093 1.091267
H  -0.550866 2.010258 1.526142
H  -1.049769 3.159866 0.254367
H  -4.609998 -0.056976 -0.641517
H  -3.309843 0.033254 -1.849007
H  1.510239 2.959097 0.49534
H  0.890158 2.639462 -1.134018
H  0.984037 -2.506697 0.110877
H  3.569688 1.753034 -0.234749
H  3.462345 -2.584493 -0.048693
H  4.776992 -0.441381 -0.23328
