program: Gaussian 09
title: 000147710
version: EM64L-G09RevD.01
frameworkgroup: C1[X(C6H3Cl2NO4)]
method: RPBEPBE
basis: SDD
operation: Freq
keyword: #p
keyword: freq=noraman
keyword: PBEPBE/SDD
title: #p freq=noraman PBEPBE/SDD
converged: YES YES NO NO
title: Mulliken charges:
elementType: Cl Cl O O O O N C C C C C C H H H
charge: 0.093795 0.107593 -0.204492 -0.180410 -0.180231 -0.175570 0.042347 0.324412 -0.191720 0.369271 -0.197165 0.155788 -0.738605 0.257150 0.257265 0.260571
chargesum: 0.00000
title: Mulliken charges with hydrogens summed into heavy atoms:
elementType: Cl Cl O O O O N C C C C C C
charge: 0.093795 0.107593 -0.204492 -0.180410 -0.180231 -0.175570 0.042347 0.324412 -0.191720 0.369271 -0.197165 0.155788 0.036382
polarizability: 1.58826932e+02 -2.15534863e+00 1.39650772e+02 5.24378274e-02 4.40252566e-02 4.41881014e+01
1716.lowfreq: -0.0013 0.0020 0.0024 1.7064 5.7186 6.1271 48.3893 53.2475 74.9453
frequency: 48.3874 53.2380 74.9447 88.8654 107.3555 117.6038 157.3357 167.0329 285.8000 288.6518 304.6220 321.5188 338.9589 379.0027 508.3073 523.6751 571.4334 601.4239 622.4662 655.3417 683.5607 696.6070 759.9848 919.8245 991.0221 1024.6731 1024.7674 1092.4956 1154.6471 1214.3289 1244.5081 1334.3945 1364.1341 1378.8524 1437.2185 1447.1006 1485.9300 1529.5100 1601.9674 2994.8005 3077.7103 3136.6877
redmass: 6.6859 3.7330 9.6068 1.2782 10.3043 6.3956 18.2423 28.0094 4.5395 10.4218 13.4868 14.7838 22.0403 10.8591 5.3326 4.4379 13.9181 7.2234 10.3439 6.6486 6.7912 12.6026 13.0418 4.5168 2.8371 2.5756 3.3282 6.0961 13.6512 8.2485 7.6154 12.1828 13.8791 1.2268 1.1085 1.0469 9.4712 11.1990 8.6422 1.0374 1.0960 1.1008
irintensity: 1.7172 6.3012 0.0252 0.0695 1.1360 5.1946 0.2131 0.0948 1.9339 0.3376 0.2414 0.1325 0.6486 4.2562 16.0244 4.5380 6.2282 3.2308 2.3045 17.6341 0.0620 0.9422 24.6521 66.6196 23.4874 17.3218 23.3454 1.7281 42.6300 409.2516 116.9172 5.7247 134.9277 59.1372 29.3841 22.6953 122.6722 34.9052 94.6430 0.4644 4.9088 9.5732
temp: 298.150 k
press: 1.00000 atm
elementType: 17 17 8 8 8 8 7 6 6 6 6 6 6 1 1 1
symmnumber: 1
zpe: 226158.1 jmol-1
zpe.correction: 0.086139 hartree
zpe.thermalcorrener: 0.098877 hartree
zpe.thermalcorrenthalpy: 0.099822 hartree
zpe.thermalcorrgfe: 0.044878 hartree
zpe.sumelectzpe: -1505.114792 hartree
zpe.sumelectthermal: -1505.102054 hartree
zpe.sumelectthermalent: -1505.101110 hartree
zpe.sumelectthermalfe: -1505.156053 hartree
dipole: -1.5994 0.2665 0.0078
dipole: 1.6215
quadrupole: -105.8449 -86.9464 -84.0899
quadrupole: 12.7503 -0.0201 -0.0519
quadrupole: -13.5511 5.3473 8.2038 12.7503 -0.0201 -0.0519
hfenergy: -1505.2009312 hartree
pointgroup: C01 [X(C6H3Cl2N1O4)]
dipole: -0.6287297 -0.1080594 0.0007083 debye
dipolederiv: -0.054034 -0.2349342 0.0542466 -0.1789448 -0.42179 0.1116798 0.0403636 0.10971 0.0294924 -0.136876 0.2934791 -0.0800517 0.2063579 -0.3203441 0.1041076 -0.0586224 0.1074912 0.0428167 -0.2138618 0.0395914 -0.0156863 0.0625643 -0.6733252 0.1515786 -0.0216766 0.1494274 -0.1077134 -0.9417353 0.0388872 -0.0334207 -0.1321961 -0.4920877 0.0466998 0.0087802 0.0528626 -0.2978047 -0.8392721 -0.0169308 -0.0160819 0.0858457 -0.4059074 0.049887 -0.0423573 0.0462023 -0.218829 -0.4575108 -0.0869716 0.0127265 -0.162836 -0.8050591 0.1388824 0.0313272 0.1414334 -0.2356123 1.6589234 0.4800414 -0.0687943 0.4010075 1.3141586 -0.2521547 -0.0483181 -0.2500282 0.2590571 -0.5730207 0.2354651 -0.0816245 0.2701854 -0.1007438 0.0510635 -0.0901673 0.0500864 0.0501639 0.0316739 0.5107117 -0.1240557 0.5109332 0.7547271 -0.1786466 -0.1245967 -0.1788433 -0.0007464 -0.569004 -0.3545886 0.0626136 -0.5259011 -0.1850494 0.0601261 0.1050235 0.0678488 0.1306654 0.5163857 -0.5230019 0.1490307 -0.3021298 0.5634561 -0.1600921 0.095562 -0.1676266 0.003425 1.5458081 -0.438927 0.1596448 -0.3752594 0.9980983 -0.2234007 0.1443522 -0.2258402 0.2168838 -0.0403608 0.0073126 -0.0039741 0.1525621 -0.4942395 0.1347909 -0.0415436 0.1318849 -0.0136186 0.0687681 0.0119916 0.0948713 0.0031961 0.1079444 -0.0076248 0.0767438 0.0148875 -0.0027111 0.0764322 -0.0317742 -0.0872412 -0.031934 0.0796615 -0.0394097 -0.0659271 -0.062556 0.0185298 -0.0723159 0.0696483 -0.022203 0.0165491 0.0805001 0.012513 -0.0089435 0.0130599 0.1260013 unknown
polarizability: 158.6875638|3.0473622|134.2496127|3.3390746|-22.0421361|49.7286287 unknown
InChI: InChI=1S/C6H3Cl2NO4/c1-2(10)5-3(7)4(8)6(13-5)9(11)12/h1H3
charge 0 multiplicity 1
16 atoms
Cl -1.480324 -2.796193 0.509233
Cl 1.952199 -2.429694 0.539921
O  -0.131952 0.87928 -0.351156
O  -3.540659 -0.34768 -0.172116
O  3.384945 0.307066 -0.089258
O  2.180276 2.203899 -0.583154
N  2.2803 0.953351 -0.281004
C  -1.18499 -0.050502 -0.159063
C  -0.624502 -1.290541 0.167004
C  1.061263 0.194243 -0.139918
C  0.807398 -1.140204 0.180318
C  -2.572748 0.447374 -0.333336
C  -2.735687 1.909915 -0.701464
H  -2.230595 2.132988 -1.659258
H  -2.269221 2.562895 0.058666
H  -3.807704 2.141503 -0.784614
