program: Gaussian 09
title: 000147790
version: EM64L-G09RevD.01
frameworkgroup: C1[X(C14H21N5O3)]
method: RPBEPBE
basis: SDD
operation: Freq
keyword: #p
keyword: freq=noraman
keyword: PBEPBE/SDD
title: #p freq=noraman PBEPBE/SDD
converged: YES YES NO NO
title: Mulliken charges:
elementType: O O O N N N N N C C C C C C C C C C C C C C H H H H H H H H H H H H H H H H H H H H H
charge: -0.273970 -0.213944 -0.229066 -0.149144 -0.095393 -0.162022 -0.090302 0.043232 -0.370951 -0.558782 -0.373734 0.266249 -0.376137 0.097178 -0.353225 -0.353074 0.228170 -0.618441 -0.632792 0.302938 -0.622381 -0.358382 0.232603 0.230996 0.276828 0.214032 0.246814 0.257435 0.209269 0.197891 0.195380 0.220299 0.245597 0.190619 0.228742 0.216423 0.186138 0.266409 0.218920 0.257503 0.221982 0.290791 0.289300
chargesum: 0.00000
title: Mulliken charges with hydrogens summed into heavy atoms:
elementType: O O O N N N N N C C C C C C C C C C C C C C
charge: -0.273970 -0.213944 -0.229066 -0.149144 -0.095393 -0.162022 -0.090302 0.043232 0.092647 -0.054533 0.117126 0.266249 0.031023 0.097178 0.062454 -0.107477 0.228170 0.017344 0.038675 0.302938 0.147896 -0.069082
polarizability: 2.93878786e+02 -3.93357510e+01 2.38038581e+02 -1.57343160e+01 -3.22935500e+00 1.31366213e+02
1716.lowfreq: -13.7049 -5.1016 0.0004 0.0007 0.0008 2.5690 17.1504 24.5080 25.9721
frequency: 16.8837 24.1772 25.4226 53.0579 53.9004 57.5498 68.4129 80.8051 109.2036 117.6022 135.2359 160.1593 172.6587 207.6690 212.3815 228.1099 237.0310 243.4333 258.7865 277.3017 306.3329 317.0447 328.2521 358.4362 378.9950 397.3996 404.7256 415.7264 443.1774 472.9716 500.2348 558.9382 589.6358 595.3239 650.5974 676.5981 690.1463 694.4331 709.6768 742.4080 743.8565 747.4952 800.7752 825.2908 842.1009 871.2369 873.5433 885.0947 926.4534 948.1934 959.2290 997.1897 1032.3665 1040.0579 1048.6479 1065.8282 1079.6130 1092.2194 1102.9320 1112.9981 1125.5754 1129.2432 1137.6487 1147.8873 1163.5999 1183.2284 1189.2967 1204.9516 1217.2586 1243.4239 1253.2682 1266.9691 1272.9306 1289.0125 1293.0991 1312.2451 1318.3356 1336.0476 1336.7665 1341.0144 1354.8142 1362.4573 1393.0026 1399.9659 1419.3240 1425.8759 1439.7441 1452.7690 1454.4290 1455.0270 1457.8527 1462.3652 1464.1195 1469.5617 1475.6562 1476.3209 1478.7119 1481.8387 1485.9293 1499.4910 1606.0971 1672.2960 2848.9098 2859.9842 2877.2352 2971.2741 2979.3084 2989.1672 3002.4105 3018.1173 3024.7428 3026.4657 3028.8974 3029.8613 3047.8392 3061.4865 3072.3467 3074.4345 3085.2930 3107.1164 3129.5503 3140.2536 3252.7725
redmass: 3.6827 5.3221 4.7774 3.7521 4.6855 5.4854 4.5336 2.8165 2.7980 3.8744 3.0331 1.4761 3.5724 1.1423 4.4701 2.9524 2.1306 2.3265 3.5789 2.0174 4.8434 2.7143 3.4080 3.3268 3.5345 2.7552 2.0430 2.7917 4.1710 2.6155 4.2951 4.0071 4.5488 4.0319 5.4294 6.0056 7.8640 6.2036 4.1083 6.5988 3.9018 5.7319 4.7749 1.7629 1.8284 1.4071 2.5517 1.5154 3.4268 1.9182 2.9186 2.5147 2.0406 1.5198 1.7224 2.1472 2.9692 1.3014 3.1601 2.5400 1.3692 1.6030 1.4456 2.1578 1.5544 1.3205 2.5997 1.3253 4.0670 1.5862 2.7902 1.5308 2.2593 2.5937 2.0883 1.4845 6.2331 4.6609 1.5276 1.4207 1.7116 1.3308 2.5429 2.1538 1.1412 2.5643 1.1535 1.1127 1.6307 1.1212 1.6400 1.1014 1.0615 1.0864 1.3406 1.0961 1.7727 1.0626 1.0630 1.1003 8.2046 9.4582 1.0571 1.0603 1.0666 1.0623 1.0604 1.0632 1.0669 1.0718 1.0740 1.0328 1.0932 1.0973 1.0957 1.1012 1.1005 1.1005 1.1006 1.0878 1.1020 1.1030 1.0994
irintensity: 0.5896 0.5442 0.3764 0.4978 0.0059 2.1952 1.0812 1.3228 0.1705 3.5348 3.0244 2.5732 7.3469 0.7510 2.9818 1.2292 2.0151 0.7670 0.4522 6.2928 5.8724 6.2782 6.8640 3.5475 7.9382 3.6263 3.4024 4.4562 0.3095 1.1055 3.3232 9.1019 5.2501 0.4831 3.3561 5.0165 10.6428 4.5411 9.3610 1.3542 21.3730 7.2867 6.4187 2.6142 8.8974 14.6398 7.7916 35.7539 2.7883 11.7429 3.7532 13.8812 21.3957 11.0890 15.2436 20.9469 13.6466 4.9849 46.0514 3.6935 0.1100 14.6487 12.6280 5.1780 12.9600 12.2433 240.8435 18.7215 37.8058 8.2505 234.0995 7.3658 21.0260 50.6393 2.3008 23.1916 68.0411 93.6195 54.2897 13.1470 74.1433 5.8885 41.0281 35.3498 2.8393 21.3924 6.3175 20.6518 102.5091 15.1584 54.0368 16.9110 17.9306 9.6401 9.9716 12.2819 6.1500 20.4847 7.2291 5.7923 133.7209 2.9548 98.8973 80.0749 197.4243 49.6600 38.0051 80.8513 11.9698 41.2552 31.4169 15.8990 5.6041 33.2993 73.3500 6.0371 17.4104 28.8445 29.1072 5.3190 5.0260 4.2461 1.8018
temp: 298.150 k
press: 1.00000 atm
elementType: 8 8 8 7 7 7 7 7 6 6 6 6 6 6 6 6 6 6 6 6 6 6 1 1 1 1 1 1 1 1 1 1 1 1 1 1 1 1 1 1 1 1 1
symmnumber: 1
zpe: 912409.0 jmol-1
zpe.correction: 0.347518 hartree
zpe.thermalcorrener: 0.370078 hartree
zpe.thermalcorrenthalpy: 0.371022 hartree
zpe.thermalcorrgfe: 0.292836 hartree
zpe.sumelectzpe: -1043.728174 hartree
zpe.sumelectthermal: -1043.705614 hartree
zpe.sumelectthermalent: -1043.704669 hartree
zpe.sumelectthermalfe: -1043.782855 hartree
dipole: -7.6922 5.3751 3.2479
dipole: 9.9302
quadrupole: -140.8959 -128.1178 -131.0609
quadrupole: 5.8222 1.2047 4.7188
quadrupole: -7.5377 5.2404 2.2973 5.8222 1.2047 4.7188
hfenergy: -1044.0756918 hartree
pointgroup: C01 [X(C14H21N5O3)]
dipole: 3.4250411 1.3399364 -1.3180204 debye
polarizability: 308.5177457|21.9921478|222.5802626|-17.3195172|8.0420113|132.1855717 unknown
InChI: InChI=1S/C14H21N5O3/c1-16(2)6-4-7-18-8-5-11(14(18)20)9-12-15-10-13(17(12)3)19(21)22/h9-10H,4-8H2,1-3H3
charge 0 multiplicity 1
43 atoms
O  0.491453 -0.024895 0.79199
O  -5.557584 -0.850875 0.356155
O  -3.82779 -1.8013 -0.811962
N  2.512712 1.038298 0.170102
N  2.742463 -2.964556 0.117888
N  -2.311594 0.625322 -0.423316
N  -3.006456 2.469173 0.740993
N  -4.362053 -0.817235 -0.146427
C  2.988637 2.286988 -0.456272
C  1.735775 3.211042 -0.458271
C  3.441428 -0.013765 0.613072
C  0.568631 2.274819 -0.170886
C  3.976603 -0.894672 -0.544003
C  1.12758 0.962288 0.306881
C  2.939662 -1.966429 -0.958672
C  -0.744999 2.651981 -0.220232
C  -1.968954 1.896257 0.037134
C  3.740342 -4.049544 0.09338
C  1.355364 -3.458957 0.237316
C  -3.608312 0.380108 0.060448
C  -1.516508 -0.221711 -1.331735
C  -4.00685 1.527854 0.775345
H  3.35812 2.098527 -1.483831
H  3.825841 2.711722 0.128157
H  2.902021 -0.671294 1.3193
H  4.278124 0.473995 1.150452
H  1.619122 3.74901 -1.41392
H  1.820813 3.971377 0.340575
H  4.904585 -1.393683 -0.20464
H  4.252896 -0.268544 -1.41655
H  3.254734 -2.445497 -1.918882
H  1.971102 -1.469253 -1.151988
H  -0.95701 3.714361 -0.404101
H  3.643863 -4.718713 -0.800009
H  3.635042 -4.673257 0.999225
H  4.763219 -3.631352 0.09185
H  1.005384 -4.037475 -0.654575
H  0.67983 -2.601521 0.398893
H  1.276639 -4.120976 1.118805
H  -2.168748 -0.646663 -2.107486
H  -0.737081 0.40824 -1.786915
H  -1.037341 -1.034593 -0.767409
H  -4.951903 1.687697 1.286721
