program: Gaussian 09
title: 000147725
version: EM64L-G09RevD.01
frameworkgroup: C1[X(C21H13Cl)]
method: RPBEPBE
basis: SDD
operation: Freq
keyword: #p
keyword: freq=noraman
keyword: PBEPBE/SDD
title: #p freq=noraman PBEPBE/SDD
converged: YES YES NO NO
title: Mulliken charges:
elementType: Cl C C C C C C C C C C C C C C C C C C C C C H H H H H H H H H H H H H
charge: -0.089544 0.003255 -0.000608 0.272739 0.556852 0.231178 0.294781 0.495886 0.474375 -0.803691 -0.423119 -0.521546 -0.519237 0.412402 -0.480963 -0.376934 -0.466293 -0.465874 -0.446740 -0.244685 -0.265777 -0.829573 0.271174 0.222336 0.249790 0.237552 0.239121 0.228833 0.244414 0.242635 0.238640 0.228707 0.231854 0.283900 0.274159
chargesum: 0.00000
title: Mulliken charges with hydrogens summed into heavy atoms:
elementType: Cl C C C C C C C C C C C C C C C C C C C C C
charge: -0.089544 0.003255 -0.000608 0.272739 0.556852 0.231178 0.294781 0.495886 0.474375 -0.532517 -0.200783 -0.271756 -0.281684 0.412402 -0.241842 -0.148102 -0.221879 -0.223239 -0.208100 -0.015978 -0.033923 -0.271514
polarizability: 4.54235784e+02 2.53551970e+01 2.73612070e+02 -1.22831589e+01 5.96199898e+00 1.01734692e+02
1716.lowfreq: -9.8909 -5.8416 -0.0021 -0.0016 -0.0012 10.9528 39.0723 49.6428 66.6628
frequency: 39.0173 49.6185 66.6619 108.4201 157.4269 179.3894 190.9562 211.3349 233.2019 289.3001 305.5842 315.5445 355.5882 400.5083 413.7982 449.4454 479.7803 491.0344 506.3928 510.2531 524.4559 526.6635 547.9757 558.9825 564.7317 571.6805 605.3398 644.9775 687.9040 695.3138 722.8788 750.4489 756.7373 770.0602 801.8847 812.2163 827.9000 833.8964 853.0675 864.9581 872.8169 902.1127 915.5929 922.7022 932.9255 936.4171 973.9619 980.8670 985.6661 986.7769 992.5987 1062.5416 1080.0654 1102.9860 1123.1541 1130.7028 1158.1179 1178.2855 1192.1966 1200.6814 1228.9114 1241.5201 1247.7611 1256.0728 1267.2719 1279.5797 1321.7792 1333.2458 1393.4825 1401.8274 1408.4466 1416.9327 1427.9371 1432.5759 1446.6479 1465.3284 1470.6652 1480.1552 1498.1462 1521.7671 1572.9551 1587.9795 1598.5287 1608.5735 1617.6047 1636.5413 3067.1934 3121.7898 3124.1813 3126.8529 3128.1042 3133.0863 3144.2720 3145.6454 3146.4032 3149.3353 3158.2417 3161.0645 3170.7400
redmass: 7.2689 8.2575 6.1567 6.4059 4.6020 4.2703 4.3865 4.0519 4.1181 4.5554 3.9297 5.9158 5.2582 3.8572 3.6797 4.5659 6.6615 4.7548 3.5858 5.5693 4.4935 4.4933 3.5101 3.2876 5.3540 5.2767 6.8626 5.0808 6.1018 3.5553 2.8493 5.5575 1.4819 1.2652 5.4010 1.8007 2.0393 3.9129 3.3972 1.9053 2.8232 1.8890 1.5552 1.6278 2.8870 2.4973 1.4368 1.3711 1.6533 3.1513 1.4427 2.6506 1.9715 2.1744 2.3561 1.1811 1.4154 1.1987 1.2852 1.3265 1.8114 1.5695 1.2966 1.8557 1.8629 1.9636 3.3595 3.0042 2.9705 2.8478 2.9593 4.4699 3.7367 3.2067 2.9144 3.5337 1.2722 3.7902 4.4241 4.5583 5.5886 7.0927 5.9573 6.6750 6.3051 7.4297 1.0577 1.0861 1.0862 1.0876 1.0885 1.0917 1.0979 1.0968 1.1010 1.0945 1.0990 1.0971 1.0948
irintensity: 0.4415 1.5634 0.8244 1.6556 0.9890 0.7871 0.5942 8.4801 2.2735 2.4574 0.0521 2.5621 3.1995 2.0607 0.9461 3.0839 1.0904 7.5560 2.4366 2.4965 9.1057 10.8272 6.7509 8.1952 15.1516 46.8680 3.1941 16.4308 0.7795 0.2849 51.2932 0.5674 7.4638 16.1335 6.1268 42.9424 4.4242 7.8069 4.4004 9.4213 63.6302 8.7543 0.8697 7.6693 18.7937 21.1205 0.2222 3.4593 0.7580 0.9321 0.2376 3.7499 4.9737 5.5038 3.2188 9.0331 2.9001 0.6176 2.1211 31.6659 2.5835 1.4513 29.9026 16.7766 1.6298 9.0719 0.2849 0.5537 11.6180 11.0069 0.2822 0.1376 5.3510 5.4621 4.6814 14.3819 10.2704 3.6867 0.5302 3.3192 1.7984 2.3619 7.8496 9.0989 13.9345 0.4209 25.5920 0.3464 0.4376 0.6391 14.5644 16.7320 0.5994 20.0353 16.1326 13.2445 43.3814 12.3651 42.7233
temp: 298.150 k
press: 1.00000 atm
elementType: 17 6 6 6 6 6 6 6 6 6 6 6 6 6 6 6 6 6 6 6 6 6 1 1 1 1 1 1 1 1 1 1 1 1 1
symmnumber: 1
zpe: 707266.0 jmol-1
zpe.correction: 0.269383 hartree
zpe.thermalcorrener: 0.285023 hartree
zpe.thermalcorrenthalpy: 0.285967 hartree
zpe.thermalcorrgfe: 0.226083 hartree
zpe.sumelectzpe: -1266.707976 hartree
zpe.sumelectthermal: -1266.692336 hartree
zpe.sumelectthermalent: -1266.691392 hartree
zpe.sumelectthermalfe: -1266.751276 hartree
dipole: -1.4229 1.7232 -1.6113
dipole: 2.7551
quadrupole: -118.6900 -117.6667 -141.2073
quadrupole: 8.5390 -9.2869 5.3564
quadrupole: 7.1647 8.1879 -15.3526 8.5390 -9.2869 5.3564
hfenergy: -1266.9773589 hartree
pointgroup: C01 [X(C21H13Cl1)]
dipole: -0.4689393 0.7027707 -0.6790504 debye
polarizability: 457.9131201|4.2592018|270.5495038|-5.310334|-1.2031912|101.1199218 unknown
InChI: InChI=1S/C21H13Cl/c22-12-16-5-2-6-17-18-10-9-14-4-1-3-13-7-8-15(11-19(16)17)21(18)20(13)14/h1-11H,12H2
charge 0 multiplicity 1
35 atoms
Cl 4.420678 -2.610581 1.151392
C  -0.712622 -0.081846 -0.047663
C  -2.151142 -0.053936 0.009297
C  0.045373 1.134956 -0.002322
C  -0.028381 -1.359329 -0.143563
C  1.498331 1.081435 -0.059919
C  2.1606 -0.205844 -0.17695
C  -2.846715 1.203987 0.105984
C  -2.908462 -1.282267 -0.027713
C  1.373768 -1.395466 -0.205621
C  -0.680886 2.379085 0.096075
C  -0.816552 -2.577701 -0.171822
C  -2.065911 2.41395 0.146663
C  3.607797 -0.255596 -0.258003
C  -2.194064 -2.542262 -0.118002
C  2.307456 2.26192 0.001092
C  -4.271065 1.216524 0.159582
C  -4.323671 -1.227778 0.028252
C  4.349458 0.931176 -0.185137
C  -4.998218 0.012975 0.120313
C  3.701208 2.192563 -0.053939
C  4.339748 -1.545476 -0.45826
H  1.869472 -2.370189 -0.248022
H  -0.132957 3.324561 0.129902
H  -0.285111 -3.534143 -0.236559
H  -2.589947 3.374146 0.219682
H  -2.777741 -3.46993 -0.140677
H  1.835257 3.24349 0.097781
H  -4.794568 2.176764 0.233071
H  -4.896388 -2.162127 0.000408
H  5.44381 0.887798 -0.233361
H  -6.092464 0.034066 0.162338
H  4.300096 3.107594 -0.000044
H  5.396523 -1.387538 -0.712218
H  3.866488 -2.223281 -1.182836
