program: Gaussian 09
title: 000147774
version: EM64L-G09RevD.01
frameworkgroup: C1[X(C20H23N6)]
method: RPBEPBE
basis: SDD
operation: Freq
keyword: #p
keyword: freq=noraman
keyword: PBEPBE/SDD
title: #p freq=noraman PBEPBE/SDD
converged: YES YES NO NO
title: Mulliken charges:
elementType: N N N N N N C C C C C C C C C C C C C C C C C C C C H H H H H H H H H H H H H H H H H H H H H H H
charge: -0.132465 -0.224104 -0.174763 -0.644975 -0.151557 -0.117271 -0.450535 -0.448493 -0.361038 -0.400802 0.306494 0.321855 0.422176 -0.341548 0.302036 -0.647285 -0.320926 -0.157891 -0.345467 -0.390955 -0.155390 -0.198935 0.455412 -0.400573 -0.386892 -0.406432 0.231901 0.245189 0.236609 0.245248 0.264982 0.243678 0.237285 0.243018 0.301471 0.292899 0.260817 0.252956 0.267657 0.339260 0.358863 0.273854 0.237966 0.239550 0.270137 0.262076 0.257918 0.242120 0.244868
chargesum: 1.00000
title: Mulliken charges with hydrogens summed into heavy atoms:
elementType: N N N N N N C C C C C C C C C C C C C C C C C C C C
charge: -0.132465 -0.224104 -0.174763 0.053148 -0.151557 -0.117271 0.026555 0.033364 0.147623 0.079501 0.306494 0.321855 0.422176 -0.040077 0.302036 0.159387 -0.053269 0.115963 -0.107501 -0.151405 0.114748 0.063141 0.455412 -0.142655 -0.144772 -0.161564
polarizability: 1.02745607e+03 3.42934160e+00 2.35684247e+02 7.34606892e+00 -3.15085330e+00 1.32975933e+02
1716.lowfreq: -9.5680 -3.1738 -0.0012 0.0011 0.0018 1.3686 13.9358 19.9293 27.1166
frequency: 13.6831 19.6501 26.9914 38.6492 62.5038 65.8131 84.6866 110.4083 112.1064 142.9226 145.8730 179.5164 188.7050 207.8334 229.0120 237.7978 252.3954 261.8544 272.4522 289.8072 299.8531 325.3487 349.3273 378.6596 398.1151 415.0729 426.7789 450.8091 496.3391 513.9306 519.0980 543.8124 556.4462 571.6561 581.0981 600.4074 626.8208 654.6803 658.7713 670.4613 691.9881 712.6958 720.0346 733.6941 741.5528 747.3397 766.7665 780.2625 805.3582 836.3902 845.7754 846.2932 851.4548 861.6314 865.0782 902.9056 914.0161 925.1442 929.0940 937.4970 974.5334 979.0431 983.0977 983.9577 991.3562 999.5898 1013.4380 1028.5403 1052.1164 1078.3801 1101.7425 1110.9826 1124.3004 1124.9890 1143.2128 1144.8445 1159.7088 1172.1087 1177.0628 1185.1959 1191.6543 1199.6887 1223.6893 1230.2562 1243.1266 1256.8313 1265.1514 1291.1137 1307.5487 1310.1649 1319.3081 1331.9710 1336.9748 1338.3172 1344.0118 1357.4933 1375.4893 1389.0727 1408.4902 1438.8955 1443.2719 1448.7537 1471.5902 1474.6522 1478.9202 1484.6427 1486.3969 1487.7572 1494.6540 1512.1500 1524.0759 1538.7223 1547.2334 1566.9225 1581.7606 1605.4229 1618.3755 1636.8105 2958.3401 3004.9944 3007.5745 3013.1295 3018.8117 3028.8619 3054.3657 3086.5841 3092.8079 3100.8732 3104.6447 3127.8231 3130.6346 3136.3784 3150.7117 3169.3240 3175.6880 3188.1069 3196.2921 3210.5597 3266.2418 3491.2123 3684.2594
redmass: 4.7380 3.3828 5.2827 3.7555 3.9097 4.5160 3.9809 3.2288 4.7117 4.2575 3.5249 1.3263 3.5224 4.0619 2.6983 1.9815 4.0447 3.6135 3.4541 3.2339 3.9655 5.1542 4.3815 3.9800 4.0838 2.9482 1.2979 3.6567 5.2627 5.0931 3.1898 4.0708 3.2709 1.8820 4.9575 5.1325 5.8151 2.6548 2.1278 5.8139 3.6226 1.8637 2.4190 3.5989 3.2056 2.5219 1.6472 2.4152 3.8626 1.3256 1.4898 1.9335 1.7571 2.1977 1.9930 5.0665 2.5428 1.3893 1.4834 1.3434 1.3983 1.7580 1.3239 1.3694 3.5774 4.4002 2.2508 2.4053 1.9900 2.6957 2.4968 1.5867 1.4685 1.3524 1.6152 2.0117 1.8588 1.1237 1.6433 1.5458 1.2750 2.0269 1.2987 2.2604 1.2795 1.6985 2.9576 2.3654 1.3230 1.4545 1.2350 1.5488 1.8127 2.0460 1.9711 3.0545 3.5226 4.7845 3.6213 2.3173 4.3730 1.3320 1.0869 1.0934 1.0575 1.2031 1.1966 1.8888 1.0995 4.6177 3.5476 5.2804 3.6487 1.7725 6.4658 5.2858 5.7635 6.6888 1.0602 1.0670 1.0349 1.0871 1.0646 1.0780 1.0882 1.0975 1.1011 1.1028 1.1052 1.0874 1.0971 1.0923 1.0969 1.0951 1.0889 1.0911 1.0972 1.1013 1.1003 1.0489 1.0990
irintensity: 1.3357 0.3862 0.8681 0.0585 2.2947 2.6363 2.7082 0.8483 1.3128 2.2542 7.7596 0.4138 3.4258 4.4156 0.5196 0.9817 2.8723 5.0139 4.2699 2.9887 3.9075 0.6553 3.5181 9.7369 11.8141 12.2963 127.1254 11.0301 20.9398 0.7424 15.6213 15.9664 1.0868 2.2651 6.4525 3.0892 0.4946 6.5919 22.3214 0.3507 3.5393 91.5208 19.5002 0.8819 9.2903 20.1468 124.5872 1.9579 3.9752 20.4105 4.2955 14.1849 31.7397 27.7797 13.0392 3.8749 15.6315 5.0247 36.1041 1.3120 5.1276 14.1783 1.4099 0.4874 4.7961 38.0582 0.4697 18.1188 163.3410 629.8748 21.0113 6.0279 19.4916 0.1896 100.0555 17.8753 160.2419 21.4362 104.0342 5.4038 147.6927 1.3525 99.4834 16.7313 22.9724 6.1361 46.5715 177.5916 43.6223 146.5683 0.1721 237.2947 415.2976 5.6833 72.1671 124.2852 22.8480 1009.4880 2221.2230 56.0385 75.9393 5.1983 11.2684 29.8792 29.9999 7.1730 30.1931 17.2904 11.9726 259.4264 171.4801 105.0674 641.6507 438.3290 280.0180 336.3770 347.2534 1.6442 64.9600 29.6937 19.8657 13.9593 27.6208 54.7127 21.0684 22.4135 27.8595 9.5590 43.7249 4.2613 5.4955 3.8948 11.9699 4.2606 1.5652 4.2477 0.0807 4.3901 10.7187 17.8861 107.8370
temp: 298.150 k
press: 1.00000 atm
elementType: 7 7 7 7 7 7 6 6 6 6 6 6 6 6 6 6 6 6 6 6 6 6 6 6 6 6 1 1 1 1 1 1 1 1 1 1 1 1 1 1 1 1 1 1 1 1 1 1 1
symmnumber: 1
zpe: 1057994.7 jmol-1
zpe.correction: 0.402969 hartree
zpe.thermalcorrener: 0.426162 hartree
zpe.thermalcorrenthalpy: 0.427106 hartree
zpe.thermalcorrgfe: 0.347876 hartree
zpe.sumelectzpe: -1102.355545 hartree
zpe.sumelectthermal: -1102.332352 hartree
zpe.sumelectthermalent: -1102.331408 hartree
zpe.sumelectthermalfe: -1102.410638 hartree
dipole: -9.7830 3.1745 -0.6966
dipole: 10.3087
quadrupole: 80.1590 -119.7949 -151.9921
quadrupole: 9.1817 -2.1244 1.3256
quadrupole: 144.0350 -55.9189 -88.1161 9.1817 -2.1244 1.3256
hfenergy: -1102.7585139 hartree
pointgroup: C01 [X(C20H23N6)]
dipole: 3.8534301 1.1822071 -0.4501251 debye
polarizability: 1027.4824797|-2.9586181|208.8846489|5.559742|-45.2481934|159.7491243 unknown
InChI: InChI=1S/C20H23N6/c1-24-18(15-26-13-3-2-6-19(24)26)17-9-7-16(8-10-17)14-22-23-20(21)25-11-4-5-12-25/h2-3,6-10,13-15H,4-5,11-12,21H2,1H3
charge 1 multiplicity 1
49 atoms
N  -6.679398 0.318688 -0.05672
N  4.173021 0.512357 -0.793475
N  5.64434 -0.405071 0.626461
N  -4.878663 1.83033 -0.376003
N  -4.495692 -0.488206 0.148444
N  -3.172122 -0.094514 0.06396
C  -8.741059 -0.725681 0.498733
C  -9.024469 0.483701 -0.430086
C  -7.242178 -1.025047 0.26703
C  -7.731854 1.329355 -0.328381
C  -5.343094 0.569835 -0.097494
C  3.434268 -0.280578 0.131925
C  5.518768 0.45017 -0.484175
C  4.370184 -0.848287 1.003889
C  1.985789 -0.447064 0.134359
C  3.652325 1.185046 -1.997462
C  6.653204 1.05279 -1.064951
C  6.889462 -0.67455 1.183737
C  1.086574 0.629556 -0.153376
C  1.428602 -1.710954 0.497882
C  7.911174 0.774094 -0.50591
C  8.021926 -0.091983 0.624674
C  -0.862519 -0.825659 0.251689
C  -0.298424 0.445652 -0.093855
C  0.041585 -1.895112 0.548997
C  -2.291745 -1.063518 0.311971
H  -8.915653 -0.447309 1.553926
H  -9.375392 -1.596399 0.266798
H  -9.169499 0.141338 -1.470321
H  -9.916283 1.057498 -0.130538
H  -6.728912 -1.450626 1.143625
H  -7.079886 -1.713441 -0.583492
H  -7.524072 1.881565 -1.265293
H  -7.794823 2.059497 0.504906
H  4.207884 -1.474811 1.874291
H  2.690487 0.728565 -2.271559
H  3.503837 2.264396 -1.82272
H  4.357393 1.043311 -2.832958
H  6.543933 1.724161 -1.91922
H  -5.475979 2.637785 -0.520268
H  -3.858408 1.906347 -0.38579
H  6.906885 -1.342514 2.046336
H  1.479742 1.629269 -0.370262
H  2.093979 -2.55726 0.704345
H  8.809147 1.226435 -0.934311
H  8.996706 -0.307748 1.067328
H  -0.978131 1.2776 -0.298867
H  -0.364498 -2.878611 0.811607
H  -2.649261 -2.073995 0.569473
