program: Gaussian 09
title: 000147646
version: EM64L-G09RevD.01
frameworkgroup: C1[X(C3H3ClO2)]
method: RPBEPBE
basis: SDD
operation: Freq
keyword: #p
keyword: freq=noraman
keyword: PBEPBE/SDD
title: #p freq=noraman PBEPBE/SDD
converged: NO YES NO NO
title: Mulliken charges:
elementType: Cl O O C C C H H H
charge: -0.000330 -0.139023 -0.138817 -0.468749 0.007900 0.007878 0.322365 0.204397 0.204379
chargesum: 0.00000
title: Mulliken charges with hydrogens summed into heavy atoms:
elementType: Cl O O C C C
charge: -0.000330 -0.139023 -0.138817 -0.146384 0.212297 0.212257
polarizability: 5.59543762e+01 2.74319636e-02 5.11577311e+01 -5.85357778e+00 -5.33076130e-02 3.27163032e+01
1716.lowfreq: -0.0020 -0.0013 0.0018 4.1256 9.9539 13.9688 49.4513 84.7025 249.8307
frequency: 49.4479 84.6981 249.8299 260.1659 283.0912 403.6824 493.6821 710.4985 866.2546 961.4557 1029.1118 1049.5039 1184.9086 1213.3529 1362.9923 1383.0790 1611.4569 1654.8011 2932.1578 2941.7287 3126.7073
redmass: 8.9543 4.4926 3.4387 3.9808 2.6494 14.7560 4.7399 5.2298 2.1413 2.4874 2.9030 3.2493 1.1552 1.2479 1.1434 1.1725 8.5626 8.6482 1.0878 1.0886 1.0882
irintensity: 6.9531 8.2678 0.0652 23.6240 5.9404 4.7700 21.1793 15.2913 104.0981 39.9587 46.7031 4.9235 11.6982 0.1365 0.5425 1.8426 217.9473 108.0591 17.9945 106.8475 0.1407
temp: 298.150 k
press: 1.00000 atm
elementType: 17 8 8 6 6 6 1 1 1
symmnumber: 1
zpe: 142670.3 jmol-1
zpe.correction: 0.054340 hartree
zpe.thermalcorrener: 0.061040 hartree
zpe.thermalcorrenthalpy: 0.061985 hartree
zpe.thermalcorrgfe: 0.022165 hartree
zpe.sumelectzpe: -726.122057 hartree
zpe.sumelectthermal: -726.115357 hartree
zpe.sumelectthermalent: -726.114413 hartree
zpe.sumelectthermalfe: -726.154233 hartree
dipole: -1.7538 -0.0207 1.6762
dipole: 2.4261
quadrupole: -48.5172 -49.0444 -37.9428
quadrupole: 0.0068 1.4265 0.0147
quadrupole: -3.3490 -3.8763 7.2253 0.0068 1.4265 0.0147
hfenergy: -726.1763972 hartree
pointgroup: C01 [X(C3H3Cl1O2)]
dipole: -0.7416145 -0.0009962 0.6009109 debye
dipolederiv: -0.4715279 0.0005846 -0.0516592 -0.0001827 -0.1732767 0.0000319 0.0030867 -0.0000121 -0.12734 -0.4849602 0.4240427 0.0617379 0.2864728 -0.678773 0.022912 0.1104063 -0.0788186 -0.3808653 -0.4850386 -0.4239952 0.0616729 -0.2867261 -0.6792477 -0.0229314 0.1111071 0.078956 -0.3803155 0.5250998 -0.0013477 0.0387622 0.0001555 -0.7074319 -0.0001448 -0.1121077 0.0000933 -0.0199855 0.4462508 -0.6330227 -0.2173198 -0.5200767 1.0326281 -0.1859486 -0.1440663 -0.3593125 0.5653847 0.4476061 0.6334058 -0.2173949 0.5201989 1.0342721 0.1863929 -0.1455283 0.3589987 0.5644661 -0.0284389 0.0001661 0.0441247 0.000061 0.0768759 -0.0003254 -0.0225266 0.0001193 0.0191323 0.0256968 0.0190545 0.1399127 0.0500093 0.0475891 0.0389586 0.0997603 0.1182665 -0.1204957 0.0253121 -0.0188881 0.1401634 -0.0499119 0.0473641 -0.0389451 0.0998684 -0.1182906 -0.1199811 unknown
polarizability: 56.7524842|-0.0229505|51.1576796|-3.8839314|0.0064258|31.9182467 unknown
InChI: InChI=1S/C3H3ClO2/c4-3(1-5)2-6/h1-3H
charge 0 multiplicity 1
9 atoms
Cl -2.314969 0.001551 -0.64726
O  0.955522 -2.002548 -0.506495
O  0.954553 2.003258 -0.506184
C  -0.426219 -0.000554 -0.750988
C  0.056222 -1.275142 -0.039428
C  0.055637 1.275002 -0.039821
H  -0.133784 -0.001972 -1.810512
H  -0.455957 -1.48733 0.929043
H  -0.458406 1.487134 0.927644
