program: Gaussian 09
title: 000147673
version: EM64L-G09RevD.01
frameworkgroup: C1[X(C17H15NO4)]
method: RPBEPBE
basis: SDD
operation: Freq
keyword: #p
keyword: freq=noraman
keyword: PBEPBE/SDD
title: #p freq=noraman PBEPBE/SDD
converged: YES YES NO NO
title: Mulliken charges:
elementType: O O O O N C C C C C C C C C C C C C C C C C H H H H H H H H H H H H H H H
charge: -0.374328 -0.187696 -0.293598 -0.391495 -0.096467 0.291521 0.173818 0.564473 0.010823 -0.566340 0.336526 -0.497935 -0.293251 0.036348 0.202642 -0.695807 0.139273 -0.423635 -0.353850 -0.192327 -0.612285 -0.622375 0.331299 0.194581 0.235516 0.232419 0.291412 0.262184 0.239382 0.229103 0.228629 0.189128 0.244400 0.230380 0.189204 0.361664 0.386664
chargesum: 0.00000
title: Mulliken charges with hydrogens summed into heavy atoms:
elementType: O O O O N C C C C C C C C C C C C C C C C C
charge: -0.012664 -0.187696 -0.293598 -0.004831 -0.096467 0.291521 0.173818 0.564473 0.010823 -0.235041 0.336526 -0.067838 -0.293251 0.036348 0.202642 -0.463388 0.139273 -0.132223 -0.091666 0.047055 0.034575 0.041609
polarizability: 3.55500847e+02 -2.04269219e+01 2.40511130e+02 1.21727703e+01 3.25629919e+00 1.00163797e+02
1716.lowfreq: -0.0006 -0.0004 0.0005 3.9737 6.4307 8.7954 25.9676 37.5050 52.7699
frequency: 25.9138 37.4784 52.7672 63.7476 82.3891 119.5596 157.6328 176.0002 194.4833 210.7572 222.7621 236.0632 242.8405 270.3750 278.5700 307.3482 313.2277 332.2918 364.6371 374.9327 422.8936 426.9890 427.7887 441.0382 447.6350 470.6727 477.1701 500.7711 537.3213 552.1688 568.2787 579.9701 618.3652 655.4678 687.7447 722.5561 733.8652 759.9910 796.9707 805.6555 816.2655 855.4659 871.9365 886.9827 931.1385 948.1074 960.9268 975.7075 981.5230 997.2434 1002.9950 1039.2459 1042.6916 1048.1770 1069.7187 1090.3822 1111.2686 1133.2789 1164.3309 1169.6984 1175.0496 1181.1066 1220.4152 1249.3342 1267.7938 1280.2562 1283.4388 1293.9368 1322.1209 1340.0860 1358.8263 1405.7907 1406.8671 1420.1320 1420.8910 1438.9518 1443.4723 1448.9103 1457.4975 1462.9960 1474.0856 1477.1863 1477.9887 1486.9557 1536.7679 1550.6746 1575.9499 1588.6494 1607.9705 1629.4521 2658.4357 2823.6209 2855.3827 2869.0567 2989.0938 3021.8644 3032.3581 3080.9728 3089.8932 3094.9417 3144.3560 3167.9380 3168.8220 3178.9689 3530.2802
redmass: 4.2491 3.9209 6.1667 3.1505 4.6978 9.8376 5.5543 5.2176 4.7331 3.4659 1.4578 1.3959 2.3581 2.9789 3.4997 6.2475 4.6805 2.5520 6.0013 3.5706 3.4704 3.9018 1.9939 2.5508 5.4201 6.3632 5.1582 4.3382 7.9628 4.9186 5.1697 4.8529 6.1651 3.7292 5.6590 3.0369 5.6767 6.0465 8.1908 1.7476 3.9222 1.9423 2.7881 5.7861 1.4382 5.4631 1.8282 1.0648 3.2287 1.4172 1.8932 1.5977 2.7768 2.1805 2.1172 1.2656 2.7400 1.4077 1.5212 1.7682 1.2703 1.5189 1.7188 1.8570 2.3440 2.0042 2.8249 3.5612 4.5989 2.6521 2.3278 6.7461 4.1668 2.0875 1.5981 1.7252 1.6567 3.5247 1.1004 1.0692 1.2624 1.1204 2.0690 1.0638 4.2619 6.6702 4.1436 6.1034 6.2943 6.1735 1.0714 1.0708 1.0567 1.0569 1.0848 1.0729 1.0729 1.1013 1.1011 1.0910 1.0878 1.0916 1.0923 1.0983 1.0657
irintensity: 0.0100 2.6179 3.6331 1.0903 0.2580 0.4015 0.1454 0.2097 0.1616 0.0597 0.5631 0.2060 0.4139 3.1284 2.4240 4.4103 5.3164 10.9380 4.8674 5.1352 10.9186 24.7164 60.7549 51.0714 18.0234 1.9676 9.6571 6.1210 0.2859 1.3335 2.8814 0.7888 6.0719 12.5658 9.3116 2.6430 1.0638 11.0811 19.2149 68.5988 33.9405 12.0562 20.7207 11.5781 0.4338 16.6792 3.0353 126.0210 55.2515 4.6991 31.7224 20.8524 4.4221 48.8152 30.6666 11.2326 77.9866 17.6349 8.3677 2.5140 49.0802 53.3261 71.1305 33.4872 37.7525 35.5396 413.9356 86.8187 356.7328 88.5607 10.3904 0.6831 20.1271 47.1330 30.5616 22.9489 4.6621 239.2083 5.8117 10.6277 3.1604 24.0613 36.5270 8.5881 67.5355 174.3229 44.6212 62.2864 61.2243 47.3590 225.6419 64.7479 71.6586 278.6307 15.3639 37.4995 26.8588 25.3002 41.4285 17.5203 11.0993 4.7120 0.0689 15.4387 36.3762
temp: 298.150 k
press: 1.00000 atm
elementType: 8 8 8 8 7 6 6 6 6 6 6 6 6 6 6 6 6 6 6 6 6 6 1 1 1 1 1 1 1 1 1 1 1 1 1 1 1
symmnumber: 1
zpe: 740391.0 jmol-1
zpe.correction: 0.282000 hartree
zpe.thermalcorrener: 0.301046 hartree
zpe.thermalcorrenthalpy: 0.301990 hartree
zpe.thermalcorrgfe: 0.234349 hartree
zpe.sumelectzpe: -1010.901505 hartree
zpe.sumelectthermal: -1010.882459 hartree
zpe.sumelectthermalent: -1010.881515 hartree
zpe.sumelectthermalfe: -1010.949156 hartree
dipole: -5.3668 1.1642 -0.0085
dipole: 5.4916
quadrupole: -108.9420 -126.0252 -128.4321
quadrupole: -21.9161 -0.2259 -2.3996
quadrupole: 12.1911 -4.8921 -7.2990 -21.9161 -0.2259 -2.3996
hfenergy: -1011.1835048 hartree
pointgroup: C01 [X(C17H15N1O4)]
dipole: -2.126541 -0.380972 -0.0268476 debye
polarizability: 357.2700452|15.7083055|239.2302028|-6.9943954|-2.4278851|99.6755249 unknown
InChI: InChI=1S/C17H15NO4/c1-18(2)8-9-6-11-15(13(20)7-9)17(22)14-10(16(11)21)4-3-5-12(14)19/h3-7,19-20H,8H2,1-2H3
charge 0 multiplicity 1
37 atoms
O  -0.414872 -3.452324 0.12878
O  0.015724 2.649292 0.140367
O  2.063519 -2.481839 0.016435
O  4.405479 -1.600498 -0.094917
N  -4.674211 0.943942 -0.310292
C  -0.42982 0.274194 0.151827
C  0.088041 -1.066018 0.121243
C  -2.741757 -0.539828 0.262992
C  2.447193 -0.124077 0.008751
C  -1.814093 0.526788 0.22267
C  1.952297 1.215588 0.039897
C  -4.237919 -0.273295 0.397541
C  0.48515 1.466883 0.111748
C  1.547662 -1.290859 0.047823
C  -0.862437 -2.134819 0.161041
C  -2.252847 -1.860387 0.227141
C  3.868593 -0.339609 -0.062135
C  2.840506 2.309499 0.00239
C  4.752463 0.773747 -0.099672
C  4.237703 2.081063 -0.067291
C  -5.972817 1.454539 0.1686
C  -4.623053 0.810492 -1.780013
H  -2.171792 1.560199 0.234684
H  -4.803345 -1.187091 0.073608
H  -4.468144 -0.132351 1.473411
H  -2.96299 -2.699897 0.246292
H  2.424236 3.320521 0.02787
H  5.827067 0.577156 -0.153348
H  4.927352 2.931289 -0.096611
H  -6.193866 2.416394 -0.326835
H  -5.926726 1.635381 1.257446
H  -6.828456 0.761446 -0.033972
H  -3.606595 0.521874 -2.098137
H  -4.860468 1.782361 -2.246603
H  -5.341974 0.048303 -2.174934
H  -1.184139 -4.078462 0.164101
H  3.598736 -2.262198 -0.058496
