program: Gaussian 09
title: 000147699
version: EM64L-G09RevD.01
frameworkgroup: C1[X(C13H18BrN7O)]
method: RPBEPBE
basis: SDD
operation: Freq
keyword: #p
keyword: freq=noraman
keyword: PBEPBE/SDD
title: #p freq=noraman PBEPBE/SDD
converged: YES YES NO NO
title: Mulliken charges:
elementType: Br O N N N N N N N C C C C C C C C C C C C C H H H H H H H H H H H H H H H H H H
charge: 0.090934 -0.251736 -0.356992 -0.299002 -0.419224 -0.127640 0.021591 -0.082156 -0.580626 -0.481320 -0.366289 0.402597 -0.415148 -0.318373 -0.056845 0.175439 -0.395936 0.168589 -0.445572 -0.206948 -0.251224 -0.267364 0.231428 0.207725 0.256695 0.223558 0.251140 0.216728 0.213458 0.196460 0.336778 0.265783 0.192333 0.206437 0.298232 0.296562 0.255782 0.271260 0.264641 0.278243
chargesum: 0.00000
title: Mulliken charges with hydrogens summed into heavy atoms:
elementType: Br O N N N N N N N C C C C C C C C C C C C C
charge: 0.090934 -0.251736 -0.020214 -0.033219 -0.120991 -0.127640 0.021591 -0.082156 -0.037742 -0.042166 0.113964 0.402597 0.052721 0.091546 -0.056845 0.175439 0.002833 0.168589 -0.149010 -0.206948 0.004558 0.003897
polarizability: 2.76514783e+02 -2.96504392e+01 2.11723780e+02 1.35848674e+00 1.70893858e+01 1.51376717e+02
1716.lowfreq: -7.9052 -2.7034 -1.2930 -0.0007 -0.0005 0.0003 9.7011 16.1160 22.4021
frequency: 9.4077 15.0559 22.3754 36.6990 46.6074 49.6161 67.1959 71.0390 85.0838 105.0168 122.1327 133.9775 156.8576 163.7101 175.9924 190.6585 216.0764 239.1801 241.1091 298.8228 309.4029 321.2979 333.7384 371.8377 384.0385 437.3461 479.8614 498.3519 516.7165 544.4993 586.4953 615.9338 620.9621 630.6638 639.2127 655.0374 658.0295 680.1716 709.9777 733.4044 767.6166 790.5806 798.6774 802.8748 844.7698 876.2803 891.4849 912.2272 930.4596 942.2097 963.5428 984.4697 989.5311 1003.6206 1047.6495 1061.6262 1065.6601 1072.0862 1091.1907 1104.6216 1112.4368 1151.0407 1160.5478 1173.5854 1192.6412 1201.1160 1214.7146 1225.7891 1239.3222 1245.5105 1246.4175 1247.8976 1252.3037 1281.5567 1307.4082 1312.7414 1338.0485 1359.8634 1360.8140 1363.3608 1378.8595 1387.8287 1405.7952 1430.2235 1450.2258 1460.2929 1462.2219 1475.7962 1483.9415 1485.2984 1493.9706 1502.8204 1504.0949 1563.6679 1613.7806 1642.6330 2838.0759 2894.6472 2910.4451 2949.3857 2981.0767 2985.8547 2995.6950 2996.6170 3011.5762 3072.7416 3153.3598 3220.2312 3235.9109 3462.2535 3469.6462 3472.0505 3579.3914 3599.6999
redmass: 6.2099 4.6137 8.7106 4.6671 3.4045 2.2843 4.5107 8.8346 4.5372 4.8562 2.9909 2.5328 6.0702 3.7635 4.9847 2.4095 1.6763 3.9425 4.0721 4.8336 3.0531 6.0518 4.5445 5.2276 4.6687 4.2964 3.4987 4.5066 4.0661 4.7070 1.3221 3.0066 1.4585 2.9033 1.4082 6.7550 3.0977 4.5048 4.2099 1.1779 1.4125 4.4605 5.2574 1.2262 1.3468 2.5019 3.8852 3.9918 1.4797 2.8490 1.7507 4.1641 2.2499 3.2347 2.5666 2.3306 2.4365 3.6180 2.0791 2.2272 2.6444 1.5240 2.7016 2.8008 1.9245 2.0490 1.5480 1.7116 1.7432 1.5312 1.3341 5.8689 1.2505 1.1082 1.9250 1.3680 3.3438 1.4102 1.5111 2.4861 2.1629 1.5579 2.0544 2.9798 1.3905 1.2467 1.2322 1.1559 1.0969 2.2320 1.1173 3.9663 3.4509 4.3252 9.4233 1.0935 1.0721 1.0681 1.0668 1.0592 1.0891 1.0741 1.0920 1.0834 1.0964 1.0968 1.0935 1.0993 1.0995 1.0743 1.0771 1.0452 1.0817 1.0980
irintensity: 0.9347 0.0614 0.8019 1.1475 7.3289 2.1369 1.2480 6.0990 2.9351 2.0221 2.2639 7.0033 2.1682 7.1122 4.4369 17.5792 31.7744 5.0500 1.2746 2.1881 3.1048 16.7660 4.0496 8.5658 4.1720 1.4581 0.4548 4.7206 19.8996 1.5747 238.8070 13.5401 115.4436 3.5498 81.9035 7.6272 0.4789 18.8074 2.5329 136.8115 32.6693 0.8360 1.6491 2.1043 28.3663 22.9264 13.7338 2.2377 5.8150 12.3701 5.3988 23.7150 1.2906 28.8940 4.4926 12.8557 7.9692 0.7747 22.5953 10.4320 24.8209 58.1008 3.5078 54.6666 3.5142 9.0321 4.0244 29.4566 59.5351 2.3286 2.6492 14.8295 32.1892 1.2390 9.1530 3.2019 13.9532 3.9249 0.3597 16.7543 6.7233 40.6593 139.9057 32.3416 13.3007 56.6615 20.0293 49.8474 0.3441 155.2073 21.8399 41.1961 23.7567 16.4687 144.0477 43.6480 61.6723 16.1844 193.6747 36.8611 6.8848 35.0976 58.2026 16.9461 86.6307 9.9483 4.8898 0.9208 2.9430 3.5427 72.1467 0.3685 26.1618 1.0605
temp: 298.150 k
press: 1.00000 atm
elementType: 35 8 7 7 7 7 7 7 7 6 6 6 6 6 6 6 6 6 6 6 6 6 1 1 1 1 1 1 1 1 1 1 1 1 1 1 1 1 1 1
symmnumber: 1
zpe: 823461.4 jmol-1
zpe.correction: 0.313640 hartree
zpe.thermalcorrener: 0.336252 hartree
zpe.thermalcorrenthalpy: 0.337196 hartree
zpe.thermalcorrgfe: 0.255800 hartree
zpe.sumelectzpe: -976.455582 hartree
zpe.sumelectthermal: -976.432970 hartree
zpe.sumelectthermalent: -976.432025 hartree
zpe.sumelectthermalfe: -976.513422 hartree
dipole: -6.9896 3.7665 0.6154
dipole: 7.9637
quadrupole: -152.4156 -112.3939 -138.9751
quadrupole: -18.8433 4.4961 3.1605
quadrupole: -17.8207 22.2010 -4.3803 -18.8433 4.4961 3.1605
hfenergy: -976.7692216 hartree
pointgroup: C01 [X(C13H18Br1N7O1)]
dipole: -1.9316621 -2.4000194 0.5702406 debye
polarizability: 245.5283814|38.957948|242.8092144|-19.0334199|-18.2064956|151.2776845 unknown
InChI: InChI=1S/C13H18BrN7O/c14-10-6-19-11(7-16-4-2-15)21-12(10)13(22)18-3-1-9-5-17-8-20-9/h5-6,8,16,18,20H,1-4,7,15H2
charge 0 multiplicity 1
40 atoms
Br 1.746218 4.006185 -1.540828
O  2.216218 0.971002 -1.990643
N  0.77021 -0.686414 -1.191422
N  -3.457677 -0.258827 0.151179
N  3.047481 -2.339968 2.121462
N  -1.179807 1.031435 -0.713396
N  -2.162382 3.201097 -0.312585
N  4.220804 -0.41749 1.963515
N  -5.859141 -3.12348 0.695423
C  2.013192 -2.635286 -0.192262
C  1.662579 -1.815286 -1.458783
C  2.840591 -1.871629 0.810122
C  -3.535072 1.197321 0.033887
C  -4.755507 -0.944474 0.292034
C  -2.213052 1.82864 -0.342788
C  0.018512 1.602409 -1.086207
C  -4.554505 -2.451922 0.548955
C  1.113662 0.618055 -1.471924
C  3.577458 -0.683018 0.739245
C  0.147552 3.011578 -1.075924
C  3.882362 -1.435311 2.775068
C  -0.987157 3.771416 -0.676199
H  2.557367 -3.541525 -0.531899
H  1.07394 -2.997086 0.277396
H  2.57583 -1.400676 -1.919485
H  1.192561 -2.493761 -2.197871
H  -3.862571 1.643187 0.994066
H  -4.282604 1.549848 -0.724771
H  -5.425603 -0.82529 -0.592626
H  -5.287997 -0.498002 1.157318
H  -0.160387 -0.824479 -0.779855
H  -2.848391 -0.666014 -0.569206
H  -4.040489 -2.898646 -0.325969
H  -3.869291 -2.564701 1.42148
H  2.650573 -3.191044 2.51839
H  3.67275 -0.000724 -0.1034
H  4.201828 -1.557126 3.807467
H  -0.936533 4.864755 -0.649347
H  -6.386599 -2.844404 1.527774
H  -5.840825 -4.138545 0.571408
