program: Gaussian 09
title: 000147632
version: EM64L-G09RevD.01
frameworkgroup: C1[X(C14H12O)]
method: RPBEPBE
basis: SDD
operation: Freq
keyword: #pfreq=noraman
keyword: PBEPBE/SDD
title: #p freq=noraman PBEPBE/SDD
converged: YES YES NO NO
title: Mulliken charges:
elementType: O C C C C C C C C C C C C C C H H H H H H H H H H H H
charge: -0.302404 -0.215855 -0.356823 0.466979 -0.422263 -0.384899 0.351575 -0.400150 -0.395925 0.341372 -0.395669 -0.395668 -0.234984 -0.235307 -0.241430 0.235655 0.229831 0.226110 0.230267 0.261574 0.239114 0.240226 0.238010 0.238841 0.225841 0.225916 0.230065
chargesum: 0.00000
title: Mulliken charges with hydrogens summed into heavy atoms:
elementType: O C C C C C C C C C C C C C C
charge: -0.302404 0.019801 0.099118 0.466979 -0.191996 -0.123325 0.351575 -0.161036 -0.155699 0.341372 -0.157659 -0.156827 -0.009143 -0.009391 -0.011365
polarizability: 2.60912703e+02 -2.74794962e-02 1.41043333e+02 -4.02338074e+00 -2.10445331e+00 7.58161599e+01
1716.lowfreq: -6.0749 -0.0009 -0.0006 -0.0004 7.3199 10.3148 39.7310 61.9652 76.3820
frequency: 39.7266 61.9616 76.3739 92.4489 149.4397 175.1191 260.7525 265.0857 352.2332 404.0831 408.3337 418.8962 443.0331 508.4073 564.7146 578.1276 614.0235 634.3932 690.6038 701.4751 730.6542 738.5875 767.6870 772.5705 825.8082 842.2443 849.3816 855.0738 919.0464 952.9385 968.9402 973.5667 977.8125 988.9213 993.9571 995.7958 1017.5739 1019.0160 1040.7664 1084.5719 1094.1773 1104.0862 1122.3240 1173.6747 1186.3033 1190.3692 1202.0314 1242.0205 1290.0720 1303.9329 1314.4598 1346.3071 1374.2585 1386.3735 1416.2312 1439.3680 1470.5710 1478.5187 1520.3424 1567.9808 1588.8474 1613.0079 1624.7750 3056.9868 3090.9350 3117.4078 3122.7721 3126.9069 3131.6289 3140.2158 3145.1920 3149.2970 3154.9251 3165.3248 3166.8744
redmass: 4.9604 3.7045 3.6938 4.9029 4.6363 4.5788 5.6780 4.6922 3.8901 2.8483 3.1652 5.2132 4.3167 3.3839 2.5998 4.2408 6.5306 6.9179 4.0262 1.7470 5.0359 3.7970 3.1561 2.2652 3.7547 1.6168 1.2613 1.3899 1.4337 1.3965 1.5179 1.4439 1.4169 4.4606 1.3160 6.4634 2.2661 1.2694 1.8910 1.6256 1.3861 1.3010 1.3730 1.0526 1.7237 1.2791 1.2782 1.4378 2.8594 1.4307 1.4958 2.7070 5.8919 2.6346 3.3328 2.3643 1.1724 2.2174 2.9980 6.0046 6.5058 6.0531 6.3196 1.0521 1.0905 1.0877 1.0845 1.0875 1.0872 1.0921 1.0953 1.0962 1.0964 1.1017 1.1194
irintensity: 1.3731 3.2410 2.0193 0.3466 4.1123 1.4087 0.9092 3.1287 0.6731 0.6390 3.0540 6.3012 0.2179 15.0624 9.7361 0.6664 0.0122 0.0134 6.2886 46.8019 8.6630 27.0343 61.4551 29.4206 37.2727 9.2563 0.2798 15.7736 2.1885 8.9353 13.5481 1.6561 1.5664 0.6045 0.0748 7.8486 0.8591 1.6074 3.8304 7.9681 5.1032 2.1996 12.7327 0.0342 2.5986 1.4812 0.7545 0.8985 0.1464 3.7929 5.7766 11.5689 1.2930 8.0401 7.4873 3.6214 4.1652 40.0498 7.1562 2.3695 0.9362 6.9758 1.5568 35.1521 22.1823 20.7908 6.0613 2.0755 7.0805 14.0664 8.6352 48.7617 4.1531 28.7427 34.1609
temp: 298.150 k
press: 1.00000 atm
elementType: 8 6 6 6 6 6 6 6 6 6 6 6 6 6 6 1 1 1 1 1 1 1 1 1 1 1 1
symmnumber: 1
zpe: 564473.8 jmol-1
zpe.correction: 0.214997 hartree
zpe.thermalcorrener: 0.227185 hartree
zpe.thermalcorrenthalpy: 0.228129 hartree
zpe.thermalcorrgfe: 0.175472 hartree
zpe.sumelectzpe: -614.828698 hartree
zpe.sumelectthermal: -614.816510 hartree
zpe.sumelectthermalent: -614.815566 hartree
zpe.sumelectthermalfe: -614.868223 hartree
dipole: 0.8739 0.7594 2.0424
dipole: 2.3477
quadrupole: -81.3290 -77.0934 -93.7384
quadrupole: -3.9621 -10.7070 -1.8646
quadrupole: 2.7246 6.9602 -9.6848 -3.9621 -10.7070 -1.8646
hfenergy: -615.0436951 hartree
pointgroup: C01 [X(C14H12O1)]
dipole: -0.3363356 0.2919155 0.8092161 debye
polarizability: 260.9732301|0.0635668|116.2280232|2.0442314|-31.7736063|100.5709429 unknown
InChI: InChI=1S/C14H12O/c1-2-4-11(5-3-1)12-6-8-13(9-7-12)14-10-15-14/h1-9,14H,10H2
charge 0 multiplicity 1
27 atoms
O  4.744926 -0.211454 -0.945308
C  3.952457 -0.452478 0.32647
C  4.846683 0.753894 0.20287
C  2.465713 -0.350826 0.227218
C  1.646556 -0.957839 1.211829
C  1.843153 0.355433 -0.833284
C  -0.390178 -0.126098 0.099619
C  0.243406 -0.842704 1.151602
C  0.441211 0.464467 -0.8938
C  -1.874876 -0.005746 0.032135
C  -2.718172 -1.055865 0.49066
C  -2.489677 1.164569 -0.493679
C  -4.123052 -0.940274 0.427322
C  -3.89435 1.281392 -0.559175
C  -4.719691 0.229411 -0.098226
H  4.335654 -1.296163 0.916497
H  4.382023 1.732566 0.026621
H  5.81675 0.765792 0.715944
H  2.108401 -1.513092 2.037808
H  2.469249 0.777966 -1.627044
H  -0.365812 -1.291425 1.944156
H  -0.019627 0.981769 -1.74284
H  -2.270836 -1.982139 0.868853
H  -1.863355 2.000484 -0.825458
H  -4.752152 -1.766255 0.77786
H  -4.344981 2.196007 -0.960763
H  -5.810424 0.319307 -0.148484
