program: Gaussian 09
title: 000147705
version: EM64L-G09RevD.01
frameworkgroup: C1[X(C24H19N5O)]
method: RPBEPBE
basis: SDD
operation: Freq
keyword: #p
keyword: freq=noraman
keyword: PBEPBE/SDD
title: #p freq=noraman PBEPBE/SDD
converged: YES YES NO NO
title: Mulliken charges:
elementType: O N N N N N C C C C C C C C C C C C C C C C C C C C C C C C H H H H H H H H H H H H H H H H H H H
charge: -0.372480 -0.282856 -0.011239 0.021437 -0.140102 -0.297038 0.068341 0.379340 0.293584 0.361739 0.079799 -0.232340 -0.082650 -0.369807 -0.388508 -0.374605 -0.372160 -0.342717 -0.370174 0.102594 -0.260523 -0.250067 -0.256129 -0.254937 -0.257030 -0.251327 -0.243245 -0.240031 -0.247034 -0.243963 0.298370 0.265560 0.269475 0.269009 0.261935 0.272487 0.251073 0.231505 0.229901 0.229021 0.225134 0.232815 0.227159 0.229338 0.232928 0.230217 0.269106 0.234850 0.374246
chargesum: 0.00000
title: Mulliken charges with hydrogens summed into heavy atoms:
elementType: O N N N N N C C C C C C C C C C C C C C C C C C C C C C C C
charge: 0.001766 -0.282856 -0.011239 0.021437 -0.140102 -0.062189 0.068341 0.379340 0.293584 0.361739 0.079799 0.066030 -0.082650 -0.104248 -0.119032 -0.105596 -0.110225 -0.070230 -0.119100 0.102594 -0.029019 -0.020167 -0.027108 -0.029802 -0.024215 -0.024169 -0.013907 -0.007103 -0.016817 0.025143
polarizability: 3.35656523e+02 4.81807646e+00 2.70916719e+02 2.53369454e+00 5.93721811e+00 2.72128606e+02
1716.lowfreq: -5.9967 -1.0360 -0.0007 -0.0003 0.0002 5.2920 22.1583 34.8873 44.3717
frequency: 21.4029 34.8737 44.3692 54.4149 58.0703 65.5327 75.7969 87.8146 97.6395 110.4145 134.4838 154.5988 210.4532 229.2325 252.9933 254.9314 256.9220 270.5827 279.4767 288.8584 308.4278 315.8008 320.0222 360.6057 376.6496 401.9472 406.1764 413.9032 430.1360 489.3196 496.1059 519.6762 544.5544 568.2654 593.4469 609.6439 615.6815 616.5246 617.8608 629.3370 632.1950 666.0122 670.1494 674.7298 705.1406 708.6027 711.6784 747.5952 750.4011 758.7313 768.4477 783.3521 793.6954 821.9491 849.0356 854.1215 858.7901 860.9911 864.5006 867.8470 898.6424 905.4991 937.6859 941.4916 949.4063 981.5835 986.8864 990.5693 991.3460 992.0961 994.1844 995.1363 997.7821 1001.7898 1004.6805 1029.7668 1032.0127 1033.4068 1048.9094 1088.8301 1091.5992 1095.0084 1111.0707 1147.4283 1157.5980 1167.7015 1174.7378 1174.9610 1175.8234 1195.7194 1199.7709 1200.1343 1202.0862 1204.1840 1231.6513 1283.6238 1308.7475 1319.3785 1320.5210 1325.7001 1330.0238 1346.9664 1375.4009 1376.7454 1377.9845 1381.8499 1431.3864 1434.0894 1438.5738 1442.8457 1477.4024 1481.0689 1482.6492 1484.2693 1522.5295 1588.7073 1590.3078 1593.7799 1607.1233 1609.8954 1614.0988 1673.8367 3122.0742 3123.2386 3125.9340 3130.0433 3131.5257 3133.3979 3143.1421 3144.3167 3146.2103 3159.2959 3160.6346 3160.8942 3171.7692 3172.7165 3172.9981 3178.4608 3266.7366 3364.0892 3437.2675
redmass: 4.7050 6.3859 6.3430 4.7221 4.0912 5.5891 4.6946 4.5232 4.9227 5.5579 6.6966 6.6314 5.9825 4.8537 5.2532 5.2162 4.5983 4.9403 5.0677 4.5577 2.7305 3.3698 1.9932 4.3976 6.2223 2.8504 2.8873 2.9433 9.1621 3.7665 4.3245 3.7940 4.7504 5.6662 5.9920 5.3580 6.2932 6.3658 6.3386 6.3489 6.3302 6.5448 6.8176 7.0080 1.7389 1.9037 1.8179 4.2570 2.5880 1.9610 2.1601 3.3681 1.2999 1.3714 3.7170 1.2860 1.2541 1.4790 2.1938 1.6328 2.5342 4.6615 1.4944 1.9904 1.5808 1.3994 1.5430 5.3520 3.6947 3.8443 3.0261 2.0595 1.3425 1.3741 1.3523 2.4913 2.2596 2.1965 3.4934 1.6256 1.6456 1.6440 2.0060 3.5598 3.6927 2.7734 1.0599 1.0608 1.1078 2.5647 1.2043 1.3239 1.5182 1.6112 3.9902 2.5794 2.3992 2.3457 1.3734 1.3651 1.3081 1.5899 7.0271 5.4237 6.5305 8.5735 2.2254 2.2712 2.2705 4.7653 7.1528 2.1681 2.1526 2.1664 9.6384 5.9694 5.9695 6.1851 5.9407 5.9979 6.0117 7.7475 1.0855 1.0852 1.0854 1.0878 1.0882 1.0882 1.0935 1.0940 1.0935 1.0972 1.0982 1.0969 1.0978 1.0968 1.0934 1.0953 1.0979 1.0752 1.0682
irintensity: 0.7115 0.5280 1.9352 0.0984 0.2268 0.1404 0.8527 0.3442 1.0248 0.6801 3.3391 0.3202 5.5868 0.7198 3.7344 0.6139 0.1901 6.4512 1.3322 1.8036 47.1148 30.4639 13.3932 9.1056 1.8680 0.2016 0.2068 0.0407 1.0824 5.4199 1.0843 0.4585 8.1672 10.8012 0.8888 0.8805 0.3823 0.1312 0.0685 6.8717 15.5552 19.8014 6.3225 1.5040 85.4854 39.4177 20.7764 19.2775 44.6077 51.2020 22.5792 65.9728 60.9565 22.1518 53.6482 2.2715 2.5050 12.2247 3.5396 3.4580 5.4730 8.4138 0.3385 0.5442 1.4871 0.5132 0.6175 1.0595 2.1554 0.6020 4.0216 4.0382 0.0240 0.7104 0.3425 1.4076 8.6851 10.9871 17.4620 2.6411 7.0139 3.6840 298.4235 38.9091 40.1342 26.9685 1.9045 0.3200 1.7882 22.1175 3.0875 1.2286 29.9330 16.9942 6.3895 10.4978 8.9672 146.3982 8.9401 1.8544 1.5426 15.3680 0.9975 5.7933 1.6736 1.1425 5.4329 22.9347 10.3161 20.2114 5.1223 29.0405 18.6505 19.5861 102.0468 0.5796 0.3650 0.9393 4.8720 7.2637 2.5999 362.8864 3.0438 2.6829 2.1645 1.4924 4.2281 3.2459 26.1431 24.9524 25.9849 13.0781 26.6553 37.0170 18.2783 12.3141 0.0979 8.5261 2.2306 14.3692 20.9751
temp: 298.150 k
press: 1.00000 atm
elementType: 8 7 7 7 7 7 6 6 6 6 6 6 6 6 6 6 6 6 6 6 6 6 6 6 6 6 6 6 6 6 1 1 1 1 1 1 1 1 1 1 1 1 1 1 1 1 1 1 1
symmnumber: 1
zpe: 986682.0 jmol-1
zpe.correction: 0.375807 hartree
zpe.thermalcorrener: 0.399940 hartree
zpe.thermalcorrenthalpy: 0.400885 hartree
zpe.thermalcorrgfe: 0.321426 hartree
zpe.sumelectzpe: -1272.790272 hartree
zpe.sumelectthermal: -1272.766139 hartree
zpe.sumelectthermalent: -1272.765195 hartree
zpe.sumelectthermalfe: -1272.844654 hartree
dipole: -2.3207 3.0082 3.7641
dipole: 5.3482
quadrupole: -153.8733 -158.0917 -181.5004
quadrupole: 18.2876 16.3769 -7.6029
quadrupole: 10.6152 6.3968 -17.0120 18.2876 16.3769 -7.6029
hfenergy: -1273.1660797 hartree
pointgroup: C01 [X(C24H19N5O1)]
dipole: 0.6583847 -0.814048 1.8251573 debye
polarizability: 328.3063469|-21.5139956|274.1508496|-5.3862397|-1.7798786|276.2446519 unknown
InChI: InChI=1S/C24H19N5O/c25-22-21-23(27-17-29(22)30)28(16-26-21)24(18-10-4-1-5-11-18,19-12-6-2-7-13-19)20-14-8-3-9-15-20/h1-17,25,30H
charge 0 multiplicity 1
49 atoms
O  -5.392405 1.834563 0.411887
N  -0.41035 -0.029506 -0.879469
N  -1.73881 0.405838 -2.704316
N  -1.988008 0.609381 0.94326
N  -4.108099 1.271394 0.057048
N  -4.614651 1.557874 -2.342131
C  0.824863 -0.306568 -0.045914
C  1.057227 0.974409 0.810805
C  2.01852 -0.581693 -1.01774
C  0.637306 -1.590017 0.808793
C  -1.646618 0.421875 -0.390781
C  -0.529741 -0.010644 -2.280025
C  -2.447417 0.677676 -1.530616
C  1.008244 2.238663 0.164849
C  3.120405 0.295302 -1.151368
C  1.76325 -2.097182 1.512042
C  1.305145 0.939758 2.201533
C  2.02084 -1.789166 -1.768892
C  -0.577508 -2.309312 0.879815
C  -3.803561 1.204595 -1.384568
C  1.216325 3.43168 0.88646
C  4.190419 -0.016965 -2.023359
C  1.669552 -3.271909 2.285157
C  1.516823 2.134209 2.927603
C  3.078726 -2.095542 -2.647843
C  -0.672567 -3.492908 1.648589
C  1.478024 3.38551 2.275829
C  4.172572 -1.207084 -2.780699
C  0.445397 -3.977095 2.360804
C  -3.227508 1.04551 1.110912
H  0.284101 -0.299341 -2.936421
H  0.791187 2.294215 -0.908418
H  3.160385 1.21882 -0.567991
H  2.726661 -1.580771 1.431581
H  1.303788 -0.013335 2.736058
H  1.194597 -2.499868 -1.65189
H  -1.457896 -1.960648 0.335499
H  1.168415 4.394655 0.365963
H  5.036696 0.674036 -2.105932
H  2.552713 -3.641439 2.818085
H  1.698609 2.082901 4.007046
H  3.053938 -3.028648 -3.221277
H  -1.624004 -4.03522 1.685854
H  1.636886 4.310915 2.840536
H  5.000268 -1.445782 -3.457607
H  0.369421 -4.89391 2.955832
H  -3.62225 1.248473 2.109889
H  -5.505942 1.967434 -1.999338
H  -6.036767 1.071169 0.366365
