program: Gaussian 09
title: 000147671
version: EM64L-G09RevD.01
frameworkgroup: C1[X(C17H14ClNO4)]
method: RPBEPBE
basis: SDD
operation: Freq
keyword: #p
keyword: freq=noraman
keyword: PBEPBE/SDD
title: #p freq=noraman PBEPBE/SDD
converged: YES YES NO NO
title: Mulliken charges:
elementType: Cl O O O O N C C C C C C C C C C C C C C C C C H H H H H H H H H H H H H H
charge: -0.068328 -0.372589 -0.193233 -0.290735 -0.389704 -0.332122 0.283651 0.175739 0.527730 0.012938 0.338907 -0.642577 -0.285480 0.032711 0.206653 -0.501808 -0.621854 0.139713 -0.421529 -0.299673 -0.352292 -0.192119 -0.578732 0.300491 0.222460 0.238671 0.275684 0.291564 0.262998 0.231899 0.219451 0.263379 0.240672 0.364237 0.272659 0.253134 0.387435
chargesum: 0.00000
title: Mulliken charges with hydrogens summed into heavy atoms:
elementType: Cl O O O O N C C C C C C C C C C C C C C C C C
charge: -0.068328 -0.008353 -0.193233 -0.290735 -0.002269 -0.069124 0.283651 0.175739 0.527730 0.012938 0.338907 -0.342086 -0.285480 0.032711 0.206653 -0.040677 -0.346169 0.139713 -0.129965 0.151677 -0.088913 0.048553 -0.052939
polarizability: 4.02665285e+02 4.06639048e+00 2.31727388e+02 -1.08427723e+01 1.18711643e+00 9.62960327e+01
1716.lowfreq: -8.3616 -3.4991 -0.0027 -0.0027 -0.0021 1.4433 14.1000 27.2567 44.1574
frequency: 13.9071 27.2338 44.1442 49.9417 60.3097 82.2464 120.0238 122.3808 154.9506 158.6224 172.1969 194.3462 213.6615 221.0884 240.6928 300.4929 308.7879 324.7355 344.2281 366.4846 415.9238 431.4394 435.4146 441.5311 447.5072 456.5810 495.5557 504.8547 534.4920 552.4964 556.4746 582.5927 631.8700 654.7643 660.3015 688.9260 711.4315 723.9292 729.7428 759.7796 791.3943 798.9250 806.0853 857.2777 884.2273 894.3509 929.0333 941.8815 948.3957 973.4251 973.8659 988.9720 998.4231 1002.5716 1041.3351 1054.7367 1069.4314 1075.1787 1109.7215 1141.1352 1156.1224 1167.2342 1170.3997 1181.0822 1223.0873 1233.2144 1245.4847 1260.6403 1279.2758 1285.2120 1294.5337 1315.5131 1334.2287 1346.6862 1378.3574 1404.9337 1409.8896 1424.9444 1441.1968 1449.5369 1453.6972 1461.7000 1470.6046 1477.9898 1490.4208 1536.3479 1549.1888 1575.3866 1588.2505 1608.6733 1629.4222 2667.2371 2895.6110 2926.5721 2986.7569 3043.0090 3056.3044 3116.4571 3145.6062 3146.0962 3147.8200 3168.9076 3179.4901 3440.1672 3532.8348
redmass: 7.2040 8.9444 3.0541 5.9926 3.8364 3.3509 9.7179 5.0037 8.3531 5.1740 3.0219 4.8122 4.8995 4.8234 5.0197 6.6041 4.6635 5.9674 6.3111 7.0881 7.2762 2.9341 5.1915 2.8890 2.2610 8.5143 4.7614 5.0650 8.0233 5.3287 5.4521 4.5867 5.6585 4.3063 4.7658 5.9405 1.3803 2.8404 5.9155 5.8784 1.1791 6.3848 1.7687 2.6039 2.2362 2.9185 1.3808 4.5436 1.8554 2.0534 1.1087 2.0440 1.3739 3.4370 3.0077 1.7435 2.2339 2.7683 2.8327 2.7717 1.3017 1.4758 1.4229 1.5551 1.6723 1.2947 1.6904 1.2624 1.3389 2.1544 3.0851 2.1895 2.5570 3.7040 1.5877 6.7209 5.1777 3.7059 2.9813 3.4086 1.1553 1.1752 1.1334 3.3921 1.0853 4.2622 6.7472 4.0870 6.2844 6.1310 6.2939 1.0713 1.0695 1.0691 1.0885 1.0905 1.0595 1.0912 1.0878 1.1105 1.0918 1.0925 1.0984 1.0743 1.0656
irintensity: 0.5665 0.8319 1.1328 7.2624 1.1053 5.6268 0.3841 2.5377 1.6729 1.6343 2.6249 1.2724 0.4356 0.5869 0.4666 8.4242 4.1478 4.9378 1.8711 8.4101 22.4021 24.0393 13.5365 51.2580 59.4708 2.5903 3.8330 2.9176 1.2464 6.7084 1.5612 1.5478 7.4932 10.2007 7.7864 70.4896 87.9150 10.6446 3.9226 14.3690 11.0786 28.4986 65.4164 0.3240 19.9500 27.5733 1.5573 21.6835 9.5394 14.8164 137.4644 16.7194 2.3898 27.2609 4.5910 3.3822 26.4036 3.1994 77.7756 127.3050 2.6896 20.0769 64.0966 49.9965 37.7198 3.0962 96.2323 0.6398 107.5522 240.9623 181.7052 328.6887 109.0003 63.9142 13.1717 6.9804 18.3715 61.9639 17.4881 229.7858 14.6754 21.7907 10.0530 46.4890 11.2032 71.9901 175.6560 36.3218 62.1093 65.1332 41.8204 219.5858 52.9517 79.7041 14.1925 13.0222 24.7982 5.7287 10.3709 17.6897 3.9248 0.5401 14.9484 0.2956 38.1696
temp: 298.150 k
press: 1.00000 atm
elementType: 17 8 8 8 8 7 6 6 6 6 6 6 6 6 6 6 6 6 6 6 6 6 6 1 1 1 1 1 1 1 1 1 1 1 1 1 1
symmnumber: 1
zpe: 720825.3 jmol-1
zpe.correction: 0.274548 hartree
zpe.thermalcorrener: 0.294726 hartree
zpe.thermalcorrenthalpy: 0.295671 hartree
zpe.thermalcorrgfe: 0.223183 hartree
zpe.sumelectzpe: -1470.302059 hartree
zpe.sumelectthermal: -1470.281880 hartree
zpe.sumelectthermalent: -1470.280936 hartree
zpe.sumelectthermalfe: -1470.353424 hartree
dipole: 2.2253 -0.5648 0.5409
dipole: 2.3587
quadrupole: -154.8640 -147.2345 -139.2539
quadrupole: 14.5555 2.2813 -0.1282
quadrupole: -7.7465 -0.1171 7.8636 14.5555 2.2813 -0.1282
hfenergy: -1470.5766068 hartree
pointgroup: C01 [X(C17H14Cl1N1O4)]
dipole: 0.8876625 0.2391279 -0.1266144 debye
polarizability: 401.5720525|-16.5303856|215.7769263|9.5421789|44.6461565|113.3397273 unknown
InChI: InChI=1S/C17H14ClNO4/c18-4-5-19-8-9-6-11-15(13(21)7-9)17(23)14-10(16(11)22)2-1-3-12(14)20/h1-3,6-7,19-21H,4-5,8H2
charge 0 multiplicity 1
37 atoms
Cl 8.677876 -0.484669 -0.118025
O  0.410406 -2.762733 -0.876506
O  -1.106864 2.838297 1.05022
O  -2.203289 -2.229725 -0.858429
O  -4.666841 -1.760792 -0.837904
N  4.589465 0.105707 -0.232287
C  -0.250449 0.697424 0.333639
C  -0.515376 -0.62366 -0.161488
C  2.169163 0.28957 0.336489
C  -3.004542 -0.100467 -0.127492
C  -2.758468 1.217179 0.367668
C  1.066103 1.141153 0.571822
C  -1.362108 1.669254 0.615264
C  -1.910837 -1.048562 -0.406789
C  0.613333 -1.47218 -0.399176
C  3.58766 0.759392 0.635952
C  1.93032 -1.009858 -0.152402
C  -4.363528 -0.512429 -0.361434
C  -3.827616 2.098955 0.624971
C  6.002222 0.304257 0.159193
C  -5.432206 0.388147 -0.096492
C  -5.160784 1.67771 0.391179
C  6.85833 -0.75148 -0.550147
H  1.200817 2.162878 0.942351
H  3.615176 1.873706 0.586345
H  3.836381 0.494047 1.68405
H  2.7968 -1.657845 -0.339298
H  -3.599772 3.099431 1.0034
H  4.42975 0.328216 -1.224545
H  6.085072 0.161309 1.252061
H  6.396434 1.32082 -0.068914
H  -6.45359 0.044661 -0.283807
H  -5.991182 2.362789 0.591664
H  1.279929 -3.229416 -0.982035
H  6.606761 -1.769462 -0.22151
H  6.803703 -0.673894 -1.647591
H  -3.756651 -2.255231 -0.963594
