program: Gaussian 09
title: 000147675
version: EM64L-G09RevD.01
frameworkgroup: C1[X(C19H17NO4)]
method: RPBEPBE
basis: SDD
operation: Freq
keyword: #p
keyword: freq=noraman
keyword: PBEPBE/SDD
title: #p freq=noraman PBEPBE/SDD
converged: YES YES NO NO
title: Mulliken charges:
elementType: O O O O N C C C C C C C C C C C C C C C C C C C H H H H H H H H H H H H H H H H H
charge: -0.373558 -0.194590 -0.292766 -0.391535 -0.126271 -0.363252 -0.360441 -0.437975 -0.450584 -0.506537 0.557991 -0.652720 0.283245 0.173334 -0.621745 0.197900 -0.287623 0.338525 0.034891 0.010700 0.138824 -0.423598 -0.353797 -0.192877 0.182857 0.228534 0.236042 0.194452 0.213696 0.228536 0.228157 0.214273 0.238369 0.209906 0.299068 0.277530 0.291067 0.262166 0.239384 0.363768 0.386657
chargesum: 0.00000
title: Mulliken charges with hydrogens summed into heavy atoms:
elementType: O O O O N C C C C C C C C C C C C C C C C C C C
charge: -0.009790 -0.194590 -0.292766 -0.004878 -0.126271 0.048139 0.070052 0.004256 -0.008154 -0.058263 0.557991 -0.353652 0.283245 0.173334 -0.344215 0.197900 -0.287623 0.338525 0.034891 0.010700 0.138824 -0.132531 -0.091631 0.046507
polarizability: 3.96974466e+02 -6.42394496e+00 2.42145402e+02 2.15344127e+01 -1.16447757e+00 1.18033037e+02
1716.lowfreq: -22.9595 -5.0165 -2.0257 -0.0008 0.0000 0.0005 7.6636 19.0703 39.1007
frequency: -20.0391 19.0381 39.0645 51.1055 57.5306 78.1821 119.7344 138.2773 150.1061 188.4285 194.1491 211.4426 216.8570 238.5985 282.8543 302.8666 307.0841 330.5152 359.4182 386.3562 429.4127 432.9114 438.0039 447.0761 451.6135 484.6731 501.1102 534.4993 545.4809 556.1171 578.1835 593.8690 634.1801 644.8691 659.1666 665.8649 723.2405 728.8559 758.2977 761.9679 798.3361 805.4999 846.4952 856.1754 861.6975 887.0673 896.2328 898.7189 929.3317 944.2331 945.9664 958.5863 970.8159 975.9476 997.3697 1002.0133 1006.6561 1040.5808 1062.2449 1069.7996 1094.0588 1108.5510 1123.3407 1144.5118 1162.9922 1167.6049 1181.1078 1186.5709 1192.4526 1221.7369 1225.3563 1233.8354 1243.4198 1262.4565 1283.7218 1286.9812 1293.6031 1294.3983 1311.7512 1327.2387 1343.2662 1345.6916 1366.9924 1406.3677 1409.6739 1424.0076 1441.1385 1449.7832 1452.5592 1465.7396 1477.3325 1480.4046 1483.6196 1496.9311 1536.3200 1548.5051 1575.6265 1587.7756 1608.1202 1629.5819 2651.5596 2849.1234 2854.3608 2867.7508 2989.1953 3013.6157 3025.2038 3036.3110 3047.0363 3069.3545 3094.2942 3106.2267 3144.0629 3147.2611 3168.4535 3179.0484 3533.0177
redmass: 1.9075 4.4092 4.8661 6.6673 3.4017 3.0660 9.8786 3.7145 6.7704 5.5029 3.3289 5.2849 5.2580 5.1495 2.9897 6.6078 4.7397 2.0872 9.8939 5.8919 10.5078 3.3190 5.5611 1.5417 4.9792 6.4388 4.4247 8.0315 5.1477 5.5912 4.7230 4.2705 3.0273 4.4983 4.0236 4.2695 3.2469 6.0640 3.1282 1.9088 8.3635 1.7750 1.6920 2.2219 3.0633 3.4950 2.6058 1.9386 1.3906 2.1171 4.3718 1.8359 1.5893 1.0644 1.3713 4.5028 1.9188 3.1572 2.5942 2.2141 1.5768 2.6764 3.0910 2.0394 1.3933 1.4076 1.5841 1.2381 1.3282 1.5508 1.2166 1.8117 1.7389 1.4020 2.9665 1.2104 1.6885 2.0516 1.8808 2.8726 1.7926 2.9309 1.7293 7.5796 4.9456 3.8902 2.9716 3.6092 1.0999 1.0818 3.4629 1.1275 1.0810 1.1051 4.3796 6.5660 4.1389 6.2096 6.1611 6.2905 1.0714 1.0710 1.0719 1.0706 1.0860 1.0601 1.0678 1.0854 1.0871 1.1049 1.1054 1.0912 1.0878 1.0917 1.0925 1.0982 1.0656
irintensity: 0.0081 0.2425 0.9221 5.3861 0.0988 0.4221 0.4903 1.3855 0.6200 0.0464 3.8976 0.0759 0.6275 0.3903 3.5550 4.7215 4.6961 7.7134 5.3953 6.3884 15.1595 14.9011 24.9333 95.3462 17.7421 3.0376 4.5965 1.1045 4.0336 2.4444 0.6871 1.4671 0.1054 3.1851 11.0794 6.6605 3.3099 3.5098 11.2359 3.1428 28.1531 64.1036 4.9092 3.7419 16.0143 12.6312 5.3377 50.8405 0.0838 11.4628 11.9569 5.6698 5.4203 125.0913 1.2700 28.6256 20.1202 5.0444 5.4344 21.9186 0.3635 69.4902 10.1885 83.8367 41.5041 37.1171 53.1641 3.3527 6.4261 32.8297 6.0192 15.1207 81.3403 35.1112 285.2544 8.5911 164.5398 70.2445 238.5170 213.4659 2.5043 51.8945 29.9418 6.6495 21.0807 55.7591 19.3514 227.3052 12.0625 1.8203 51.9959 14.8293 1.3059 1.0242 77.6460 167.7899 33.7867 66.2825 68.0155 42.7176 231.3774 34.8822 52.7362 179.2007 14.1651 16.8494 66.5977 75.2312 13.5906 0.6747 71.2787 6.0735 11.3144 3.5321 0.6904 15.6369 36.4562
temp: 298.150 k
press: 1.00000 atm
elementType: 8 8 8 8 7 6 6 6 6 6 6 6 6 6 6 6 6 6 6 6 6 6 6 6 1 1 1 1 1 1 1 1 1 1 1 1 1 1 1 1 1
symmnumber: 1
zpe: 835267.2 jmol-1
zpe.correction: 0.318136 hartree
zpe.thermalcorrener: 0.337293 hartree
zpe.thermalcorrenthalpy: 0.338237 hartree
zpe.thermalcorrgfe: 0.269597 hartree
zpe.sumelectzpe: -1088.178587 hartree
zpe.sumelectthermal: -1088.159431 hartree
zpe.sumelectthermalent: -1088.158487 hartree
zpe.sumelectthermalfe: -1088.227127 hartree
dipole: -5.6879 -0.7420 -0.0576
dipole: 5.7364
quadrupole: -114.6768 -148.0802 -139.5342
quadrupole: -12.7262 1.5708 -0.7007
quadrupole: 19.4203 -13.9831 -5.4371 -12.7262 1.5708 -0.7007
hfenergy: -1088.4967237 hartree
pointgroup: C01 [X(C19H17N1O4)]
dipole: -2.2465391 0.1963934 0.0894366 debye
polarizability: 397.1905042|18.0183979|208.1115344|-6.2620659|56.1715362|151.8508664 unknown
InChI: InChI=1S/C19H17NO4/c21-14-5-3-4-12-16(14)19(24)17-13(18(12)23)8-11(9-15(17)22)10-20-6-1-2-7-20/h3-5,8-9,21-22H,1-2,6-7,10H2
charge 0 multiplicity 1
41 atoms
O  -0.301904 -2.554292 -1.23271
O  1.293674 2.594382 1.656921
O  2.316073 -2.03821 -1.17667
O  4.778853 -1.576911 -1.143135
N  -4.46582 0.07574 0.120845
C  -5.841312 0.100106 0.686792
C  -4.576905 0.76225 -1.194644
C  -6.747008 -0.214842 -0.532267
C  -5.899411 0.207597 -1.782338
C  -3.422059 0.600077 1.015804
C  -2.012499 0.211866 0.583924
C  -0.90009 1.007138 0.940998
C  0.407469 0.620212 0.58427
C  0.654059 -0.58621 -0.154835
C  -1.791407 -0.971964 -0.145635
C  -0.484757 -1.376753 -0.513833
C  1.529775 1.526022 1.005365
C  2.917146 1.130766 0.635801
C  2.039129 -0.958152 -0.511506
C  3.144423 -0.073985 -0.097365
C  4.494506 -0.434145 -0.441857
C  3.996275 1.954445 1.015632
C  5.573273 0.406657 -0.051937
C  5.32031 1.586373 0.668596
H  -6.094864 1.108293 1.10224
H  -5.938082 -0.637262 1.503732
H  -3.696134 0.55072 -1.82572
H  -4.640629 1.872402 -1.06427
H  -7.703732 0.331741 -0.471472
H  -6.979472 -1.292456 -0.574191
H  -5.700193 -0.667067 -2.424668
H  -6.410032 0.966056 -2.40021
H  -3.6024 0.181045 2.026948
H  -3.47437 1.713455 1.124993
H  -1.021625 1.941346 1.499439
H  -2.670197 -1.570894 -0.422677
H  3.782595 2.869114 1.575849
H  6.587495 0.10519 -0.329087
H  6.158382 2.226455 0.963858
H  -1.177964 -2.990468 -1.398304
H  3.86173 -2.041338 -1.327474
