program: Gaussian 09
title: 000147805
version: EM64L-G09RevD.01
frameworkgroup: C1[X(C20H28N6)]
method: RPBEPBE
basis: SDD
operation: Freq
keyword: #pfreq=noraman
keyword: PBEPBE/SDD
title: #p freq=noraman PBEPBE/SDD
converged: YES YES NO NO
title: Mulliken charges:
elementType: N N N N N N C C C C C C C C C C C C C C C C C C C C H H H H H H H H H H H H H H H H H H H H H H H H H H H H
charge: -0.430551 -0.429916 -0.669971 -0.699582 -0.359073 -0.386184 -0.353414 -0.369094 -0.461595 -0.473926 -0.354031 -0.354274 0.514637 0.493896 -0.390063 -0.383683 -0.463354 -0.445881 -0.398763 -0.393680 -0.327544 -0.326323 0.399358 0.358661 -0.009074 0.034172 0.209677 0.197573 0.201282 0.199841 0.209602 0.208206 0.206724 0.215324 0.209300 0.218912 0.209709 0.219733 0.289701 0.290298 0.228781 0.232813 0.217034 0.218483 0.276263 0.273378 0.218373 0.233988 0.307202 0.316131 0.289363 0.378961 0.206556 0.196045
chargesum: 0.00000
title: Mulliken charges with hydrogens summed into heavy atoms:
elementType: N N N N N N C C C C C C C C C C C C C C C C C C C C
charge: -0.140850 -0.139619 -0.046638 -0.031258 -0.152517 -0.190139 0.053836 0.032028 -0.043788 -0.051878 0.074181 0.075168 0.514637 0.493896 -0.161282 -0.150870 -0.246321 -0.227397 -0.122501 -0.120302 -0.109171 -0.092334 0.399358 0.358661 -0.009074 0.034172
polarizability: 3.90846596e+02 7.28673093e+00 2.13865753e+02 3.73381762e+00 -4.29854422e+01 2.11990170e+02
1716.lowfreq: -8.0098 -1.5655 -0.0003 -0.0001 0.0003 6.3435 21.9878 22.9118 29.1590
frequency: 21.6945 22.5541 29.1313 44.1637 54.3189 64.1554 72.4185 83.6040 93.2440 97.8878 106.1333 123.5749 138.9462 181.4179 191.3044 200.3781 224.4950 226.6042 233.5400 276.1401 285.7848 287.3689 313.5236 347.2871 352.6280 387.3800 398.4407 407.5150 411.9307 422.9992 432.1412 438.7187 446.4142 463.6264 481.1394 493.8123 511.1704 511.9640 522.7068 546.6857 569.1308 571.9336 628.1196 632.7580 647.0597 651.6728 667.5562 713.1333 715.3161 719.5497 741.5405 742.5322 791.5345 798.5275 799.1372 802.9929 811.9985 815.6575 831.4327 833.2393 834.4815 843.3956 866.4773 906.9743 944.9643 949.5403 950.3797 976.9602 982.2300 991.4442 995.5517 997.4564 1027.4994 1030.3572 1041.5007 1056.8092 1073.2226 1082.3047 1088.1362 1110.8343 1117.9991 1120.1027 1134.7111 1139.3521 1148.0580 1148.6603 1182.1566 1194.8265 1197.8662 1203.2676 1220.0163 1249.5315 1274.0743 1286.2306 1293.8345 1302.4467 1309.6212 1313.3469 1326.4493 1345.0913 1346.2066 1352.3874 1355.7848 1361.1477 1364.5191 1368.4664 1381.3002 1392.8681 1431.0159 1438.1737 1458.3612 1460.6456 1461.5031 1470.9228 1476.4930 1480.7283 1493.6632 1500.9020 1526.7462 1529.9693 1569.1212 1570.4542 1596.5813 1602.8626 1630.3232 1632.1185 1635.2520 1652.1119 2926.0936 2934.5938 2960.7787 2964.5891 2971.6832 2979.1447 2982.9776 3010.9607 3012.8461 3028.9088 3036.5873 3047.2725 3112.3805 3115.0716 3137.8881 3139.0879 3142.5331 3144.9148 3162.1860 3164.5862 3306.7410 3321.9229 3443.9407 3489.7946 3551.0030 3564.5103 3629.1709 3630.5536
redmass: 5.4806 5.1183 3.8661 6.6243 4.9153 4.0756 4.1482 4.5816 3.7907 4.3986 4.9555 4.1755 4.0460 2.4578 3.7704 3.4262 3.9897 2.3634 3.5932 3.6611 2.2706 3.8224 3.3863 2.8520 1.2035 2.4500 1.3099 1.6527 2.6424 1.7540 3.4137 3.0656 1.1572 2.5578 3.2605 3.0918 2.9810 2.4125 2.7104 1.5590 2.4419 3.1134 4.2346 6.1961 2.7455 2.5997 1.4153 2.9999 2.5207 1.6767 4.3471 4.0927 1.5669 1.4946 1.8425 1.4156 1.3063 1.3399 2.8659 1.8933 1.7137 3.0340 2.6077 2.2321 1.3594 1.6411 1.3795 1.3482 1.3935 1.8927 2.8167 2.8550 2.2219 1.6805 2.0504 1.8211 1.2474 1.4026 2.8676 2.2712 1.6711 1.8229 1.8760 1.8928 1.9350 1.9168 1.5258 1.2660 1.1675 1.1488 1.1964 1.2742 1.3147 1.3269 1.3643 1.3477 1.4625 1.4702 1.2833 2.1363 1.7625 1.7057 1.6361 1.4879 1.7081 1.5762 4.7868 4.9757 4.0089 3.9992 1.0747 1.1792 1.1825 1.1190 1.5384 1.5775 1.0929 1.1006 3.1708 3.2675 4.7163 4.5449 4.6996 3.4774 4.4677 1.4735 5.6174 1.2202 1.0638 1.0683 1.0656 1.0662 1.0759 1.0632 1.0719 1.0975 1.0941 1.0993 1.0984 1.1018 1.0866 1.0877 1.0960 1.0871 1.0872 1.0947 1.0959 1.0960 1.0756 1.0761 1.0529 1.0452 1.0763 1.0767 1.1010 1.0970
irintensity: 2.8719 1.5278 3.7272 0.5919 1.4696 8.9652 0.4866 0.3443 0.7362 0.3495 0.0721 2.1261 2.9581 9.4440 1.0435 2.7151 5.9186 0.2008 2.7960 1.7407 5.8055 4.7811 2.5266 10.9608 95.9593 31.2932 78.2060 2.4832 3.9743 80.9698 4.3725 32.1489 46.7166 18.5483 5.6481 24.4011 70.4380 14.0087 39.6462 212.9784 39.6916 18.5637 19.9406 0.4954 33.7867 5.6208 103.5969 7.2825 5.0941 12.0006 16.2856 0.7656 8.3030 70.3735 21.0006 17.0769 20.9834 40.8324 2.0687 32.3868 157.7494 5.7574 0.1024 1.0664 1.5847 3.5445 2.6565 3.2012 6.6862 0.5792 1.7263 1.0013 33.3407 3.8189 5.7564 13.7368 89.5076 107.1872 4.7043 3.1269 1.8612 8.7116 29.0700 18.4339 87.9020 75.4151 0.2217 7.4229 14.8531 19.7634 33.2814 6.0054 14.4925 9.3920 2.3369 17.9452 14.9594 34.5158 3.3775 40.7854 25.2436 13.6524 6.4173 0.5721 6.0422 2.9104 80.1578 345.8272 17.5017 12.3487 0.5924 36.4865 12.3356 16.4872 4.9817 2.3654 48.1889 76.9483 115.5281 253.5363 46.8552 33.6971 93.0498 134.9992 69.3657 72.6093 503.0768 183.4379 68.2937 71.4691 18.7414 42.5458 44.6031 50.9725 73.8821 13.1045 20.3180 5.0306 63.5367 159.3618 11.8586 12.1327 18.8911 12.8969 9.0483 14.5164 8.4450 9.2414 34.6802 19.7117 174.7909 12.0057 32.2079 29.3098 12.8191 39.9197
temp: 298.150 k
press: 1.00000 atm
elementType: 7 7 7 7 7 7 6 6 6 6 6 6 6 6 6 6 6 6 6 6 6 6 6 6 6 6 1 1 1 1 1 1 1 1 1 1 1 1 1 1 1 1 1 1 1 1 1 1 1 1 1 1 1 1
symmnumber: 1
zpe: 1197134.6 jmol-1
zpe.correction: 0.455964 hartree
zpe.thermalcorrener: 0.482121 hartree
zpe.thermalcorrenthalpy: 0.483065 hartree
zpe.thermalcorrgfe: 0.398725 hartree
zpe.sumelectzpe: -1105.502705 hartree
zpe.sumelectthermal: -1105.476549 hartree
zpe.sumelectthermalent: -1105.475605 hartree
zpe.sumelectthermalfe: -1105.559945 hartree
dipole: 3.6886 -3.5372 -1.8867
dipole: 5.4477
quadrupole: -111.6461 -177.4485 -155.1254
quadrupole: 21.4032 4.2543 6.3932
quadrupole: 36.4273 -29.3752 -7.0521 21.4032 4.2543 6.3932
hfenergy: -1105.9586695 hartree
pointgroup: C01 [X(C20H28N6)]
dipole: -0.9885199 1.6956012 -0.8610501 debye
polarizability: 380.4225676|-41.6372704|228.938359|13.6598773|40.644058|207.3415913 unknown
InChI: InChI=1S/C20H28N6/c21-19(22)15-5-9-17(10-6-15)25-13-3-1-2-4-14-26-18-11-7-16(8-12-18)20(23)24/h5-12,21,23,25-26H,1-4,13-14,22,24H2
charge 0 multiplicity 1
54 atoms
N  -1.820339 2.302561 -1.512768
N  -2.186069 -1.320277 1.282694
N  4.413093 1.00818 -0.082247
N  4.080938 -2.213219 -0.220363
N  3.634192 2.039712 1.971869
N  3.111775 -4.285493 -1.01372
C  -4.437065 0.857838 -0.836957
C  -4.453175 0.65472 0.695745
C  -4.295642 2.338249 -1.272401
C  -4.615438 -0.823948 1.133449
C  -2.948651 2.992898 -0.881004
C  -3.458926 -1.757835 0.708194
C  -0.5348 2.19553 -0.988293
C  -0.931612 -1.783382 0.886176
C  -0.127249 2.892146 0.192206
C  -0.777737 -2.810576 -0.095305
C  0.41833 1.346102 -1.629235
C  0.24576 -1.222513 1.46502
C  1.161427 2.705493 0.718033
C  0.505206 -3.222733 -0.496237
C  1.70268 1.173398 -1.094382
C  1.519522 -1.641541 1.051015
C  2.101249 1.843013 0.096325
C  1.677027 -2.639924 0.051008
C  3.437239 1.653585 0.724675
C  3.013869 -3.100211 -0.430156
H  -3.606707 0.271265 -1.275387
H  -5.374794 0.448287 -1.265081
H  -3.519574 1.063732 1.130049
H  -5.284953 1.246253 1.130439
H  -4.424449 2.412583 -2.372667
H  -5.110855 2.940612 -0.824594
H  -5.554847 -1.232622 0.712032
H  -4.723332 -0.868259 2.236951
H  -2.82413 2.948606 0.217212
H  -2.971651 4.06996 -1.156733
H  -3.380145 -1.773988 -0.398729
H  -3.702466 -2.7978 1.019941
H  -2.008306 1.819983 -2.392201
H  -2.21627 -0.614888 2.018173
H  -0.811558 3.58781 0.687959
H  -1.658153 -3.291037 -0.53421
H  0.123683 0.783853 -2.524174
H  0.156033 -0.438087 2.227021
H  1.474644 3.221598 1.631324
H  0.635464 -4.016927 -1.23867
H  2.366622 0.451561 -1.584731
H  2.394774 -1.19557 1.536963
H  5.372053 0.986905 0.268716
H  4.316693 1.05329 -1.09804
H  5.025179 -2.515697 -0.452673
H  3.949294 -1.230413 0.03732
H  4.609009 1.888148 2.304731
H  4.076039 -4.489728 -1.352281
