program: Gaussian 09
title: 000147615
version: EM64L-G09RevD.01
frameworkgroup: C1[X(C15H10N2)]
method: RPBEPBE
basis: SDD
operation: Freq
keyword: #pfreq=noraman
keyword: PBEPBE/SDD
title: #p freq=noraman PBEPBE/SDD
converged: YES YES NO YES
title: Mulliken charges:
elementType: N N C C C C C C C C C C C C C C C H H H H H H H H H H
charge: -0.471744 0.007245 0.035853 0.228395 0.242816 0.300837 0.169053 0.395797 -0.398463 -0.452726 -0.389491 -0.289476 -0.449898 -0.454890 -0.255997 -0.249352 -0.381726 0.310728 0.238645 0.241038 0.218573 0.222431 0.240940 0.245112 0.228354 0.229479 0.238470
chargesum: 0.00000
title: Mulliken charges with hydrogens summed into heavy atoms:
elementType: N N C C C C C C C C C C C C C C C
charge: -0.161016 0.007245 0.035853 0.228395 0.242816 0.300837 0.169053 0.395797 -0.159819 -0.211689 -0.167060 -0.070903 -0.208958 -0.209778 -0.027643 -0.019873 -0.143256
polarizability: 2.86669620e+02 -1.90562499e+00 2.02090344e+02 2.18911143e-03 -2.64701401e-04 6.65487606e+01
1716.lowfreq: -11.4992 -0.0007 -0.0002 0.0007 5.1002 8.8472 78.6045 88.9776 155.9588
frequency: 78.6007 88.9723 155.9587 168.2891 206.0915 295.9597 325.4458 335.3458 370.2906 413.3718 437.7446 480.6711 518.9728 525.7864 531.6925 542.0763 562.0619 606.0673 608.2360 655.1799 690.6191 694.6799 746.9263 755.0614 772.1383 804.2566 814.3264 815.0094 828.7074 857.9195 879.2969 893.1687 946.1758 947.7364 951.5893 967.9726 989.6097 1007.9673 1021.0520 1045.8808 1109.9599 1149.3275 1165.5693 1173.9767 1209.2550 1232.6256 1237.5434 1251.8569 1282.5100 1305.0147 1333.1637 1356.2663 1390.5904 1397.4276 1425.4104 1436.9903 1447.5353 1460.4761 1467.2308 1541.9518 1552.2465 1574.1080 1591.5577 1612.0274 1632.4699 3115.3577 3120.2165 3127.5888 3134.6365 3137.9264 3151.6300 3156.5337 3169.3635 3178.7660 3610.1946
redmass: 4.6047 4.3907 5.5621 4.7723 4.1729 4.0965 5.0347 5.5029 7.0439 3.0064 2.8293 5.8887 1.5968 1.9197 7.5205 4.5062 3.2553 7.8636 4.6561 6.5996 6.0529 3.1647 6.0329 1.3327 3.9578 2.6917 1.3909 5.1057 1.6209 5.8871 1.8034 1.4567 1.3867 6.0452 1.3765 1.4083 1.3511 5.0248 2.3399 2.2601 2.2493 1.2835 2.2609 1.1067 1.7171 1.6340 1.5515 1.9449 2.6103 2.0766 4.4777 1.8602 2.6130 3.4389 3.7716 3.0254 2.1244 3.3412 3.6259 5.0978 7.1702 5.8891 6.5029 7.4170 6.9630 1.0914 1.0871 1.0869 1.0892 1.0892 1.0979 1.0959 1.0977 1.0944 1.0805
irintensity: 0.0000 0.2767 0.3503 0.0045 6.4158 1.2949 2.3520 3.4658 0.6881 7.8495 0.4925 0.6513 73.4523 26.1387 0.7127 0.5855 10.6888 14.1830 10.3575 1.9235 3.8172 17.0877 0.1070 38.5718 0.0823 1.1271 10.3798 0.3276 134.5602 0.9001 0.6819 5.2975 0.5522 0.1063 0.5297 2.4863 0.2004 14.4903 10.3387 5.3777 4.3659 6.4744 2.2278 0.4474 2.3645 12.3074 8.5746 31.8670 25.1244 22.9083 28.6331 44.3102 0.6722 3.9440 1.1245 16.9535 1.8375 1.1056 53.6847 33.3981 5.4609 1.0544 2.0692 41.2355 32.2987 26.4546 3.9289 2.1814 6.2610 21.7056 25.1232 35.5638 2.1552 31.3073 72.5396
temp: 298.150 k
press: 1.00000 atm
elementType: 7 7 6 6 6 6 6 6 6 6 6 6 6 6 6 6 6 1 1 1 1 1 1 1 1 1 1
symmnumber: 1
zpe: 547747.4 jmol-1
zpe.correction: 0.208626 hartree
zpe.thermalcorrener: 0.220112 hartree
zpe.thermalcorrenthalpy: 0.221056 hartree
zpe.thermalcorrgfe: 0.171202 hartree
zpe.sumelectzpe: -686.003323 hartree
zpe.sumelectthermal: -685.991837 hartree
zpe.sumelectthermalent: -685.990893 hartree
zpe.sumelectthermalfe: -686.040747 hartree
dipole: 2.6537 2.6201 -0.0002
dipole: 3.7292
quadrupole: -104.2567 -76.5433 -105.1139
quadrupole: -8.6195 0.0013 -0.0005
quadrupole: -8.9521 18.7613 -9.8092 -8.6195 0.0013 -0.0005
hfenergy: -686.2119486 hartree
pointgroup: C01 [X(C15H10N2)]
dipole: 1.0510071 1.0237427 -0.0000724 debye
polarizability: 286.6399487|-2.4779308|202.1200162|0.0021873|-0.0002795|66.5487606 unknown
InChI: InChI=1S/C15H10N2/c1-2-4-11-10(3-1)5-6-13-15(11)12-7-8-16-9-14(12)17-13/h1-9,17H
charge 0 multiplicity 1
27 atoms
N  -1.608326 1.91455 0.000006
N  -4.229172 -0.776968 0.000134
C  -0.056785 0.207354 0.000054
C  -0.237666 1.624604 0.000101
C  -1.391137 -0.380075 0.000104
C  1.277926 -0.335068 0.000034
C  -2.331067 0.715426 0.000006
C  2.387695 0.602881 0.000138
C  0.848153 2.545186 0.000176
C  2.13941 2.023505 0.000202
C  1.573641 -1.735512 -0.000026
C  -1.938329 -1.689452 0.000223
C  3.728165 0.101136 0.000173
C  -3.723236 0.486473 0.000002
C  2.895898 -2.195412 0.000014
C  3.984933 -1.273204 0.000124
C  -3.341887 -1.827869 0.000234
H  -2.012394 2.848298 -0.000088
H  0.67439 3.626389 0.000155
H  3.001364 2.700951 0.000281
H  -1.314097 -2.586396 0.000263
H  0.755522 -2.460312 -0.00013
H  4.558542 0.817646 0.000257
H  -4.450276 1.307565 -0.000072
H  3.097136 -3.272469 -0.000053
H  5.015568 -1.643809 0.000181
H  -3.798772 -2.823415 0.000308
