program: Gaussian 09
title: 000147613
version: EM64L-G09RevD.01
frameworkgroup: C1[X(C13H7Cl2N)]
method: RPBEPBE
basis: SDD
operation: Freq
keyword: #p
keyword: freq=noraman
keyword: PBEPBE/SDD
title: #p freq=noraman PBEPBE/SDD
converged: NO NO NO NO
title: Mulliken charges:
elementType: Cl Cl N C C C C C C C C C C C C C H H H H H H H
charge: -0.032193 -0.038242 -0.029719 0.468561 0.455306 -0.097226 -0.111412 -0.344113 -0.343654 -0.355791 -0.270510 -0.298242 -0.228802 -0.121017 -0.238969 -0.227825 0.260477 0.255940 0.293604 0.270940 0.260496 0.235003 0.237390
chargesum: 0.00000
title: Mulliken charges with hydrogens summed into heavy atoms:
elementType: Cl Cl N C C C C C C C C C C C C C
charge: -0.032193 -0.038242 -0.029719 0.468561 0.455306 -0.097226 -0.111412 -0.344113 -0.083177 -0.099851 0.023094 -0.027302 0.031693 -0.121017 -0.003967 0.009565
polarizability: 3.16149042e+02 1.63671954e+01 1.81095378e+02 1.91130034e-04 -5.83634329e-03 5.99483558e+01
1716.lowfreq: -0.0017 -0.0015 0.0016 8.0309 10.4352 14.2579 64.1047 89.7717 119.0961
frequency: 64.0579 89.7337 119.0823 149.0306 187.9133 206.4594 264.5272 269.2046 320.9662 327.3763 379.8455 403.8293 433.5118 472.8241 490.5465 527.1037 560.4989 585.8047 604.5251 617.2542 646.1992 690.1981 735.6620 776.8657 787.1179 790.3752 827.5818 862.5525 882.0880 891.8329 910.6714 921.3834 968.1506 975.0756 999.7502 1015.3338 1054.8290 1115.5917 1146.3686 1170.2085 1218.3884 1232.9522 1253.0838 1292.7580 1303.4666 1341.6603 1370.1079 1385.2397 1426.8511 1447.7801 1469.2666 1521.4401 1538.9678 1555.9962 1604.1868 1628.4668 3135.7690 3149.2010 3155.9374 3165.4275 3174.9876 3177.8026 3182.8125
redmass: 8.4566 5.6898 4.4411 12.6801 6.0989 12.0696 9.4770 5.5011 6.3709 9.6951 9.2740 3.4549 5.9375 2.9498 6.9612 3.6435 8.4132 5.1573 4.5769 7.0752 7.2091 7.6266 3.5503 1.3590 2.3763 7.6293 1.8050 5.6908 1.6418 1.5298 7.1582 7.0829 1.3142 1.3443 1.3275 2.1798 2.1648 1.8996 1.4396 1.1474 1.4189 3.3529 1.6380 5.0360 2.7237 2.0555 4.0731 6.5674 2.9532 3.1891 3.1406 8.3747 7.8539 8.1406 6.9653 6.6304 1.0860 1.0893 1.0876 1.0958 1.0999 1.0971 1.0936
irintensity: 0.3513 2.5769 0.0874 0.1830 0.3503 0.4073 4.1809 0.1633 0.1497 6.4565 0.9306 8.6548 2.5401 0.1438 13.3171 5.5569 3.6446 6.1711 5.4045 3.5089 16.0871 13.4367 1.3540 101.0826 1.6113 12.9527 41.1846 14.9217 0.3386 18.3494 79.0099 48.7836 0.5725 1.7349 0.0929 6.3155 34.3015 0.4501 2.9648 1.6646 1.7823 11.3049 27.8608 7.4735 43.6746 0.7188 0.1803 61.9320 56.0190 32.5093 5.1199 34.3561 28.5627 0.9005 97.6795 16.8699 4.8476 6.2184 0.6809 11.2327 25.5607 2.5586 2.1435
temp: 298.150 k
press: 1.00000 atm
elementType: 17 17 7 6 6 6 6 6 6 6 6 6 6 6 6 6 1 1 1 1 1 1 1
symmnumber: 1
zpe: 418540.3 jmol-1
zpe.correction: 0.159414 hartree
zpe.thermalcorrener: 0.171567 hartree
zpe.thermalcorrenthalpy: 0.172511 hartree
zpe.thermalcorrgfe: 0.120322 hartree
zpe.sumelectzpe: -1473.392807 hartree
zpe.sumelectthermal: -1473.380653 hartree
zpe.sumelectthermalent: -1473.379709 hartree
zpe.sumelectthermalfe: -1473.431898 hartree
dipole: -2.3799 0.9670 0.0000
dipole: 2.5689
quadrupole: -95.4806 -100.7000 -109.9368
quadrupole: 7.6063 -0.0005 -0.0004
quadrupole: 6.5585 1.3391 -7.8977 7.6063 -0.0005 -0.0004
hfenergy: -1473.5522201 hartree
pointgroup: C01 [X(C13H7Cl2N1)]
dipole: -0.8817239 -0.4939945 -0.0000075 debye
dipolederiv: -0.1140856 -0.0785844 0.0000037 -0.1068566 -0.8256187 0.0000383 0.0000014 0.000016 -0.0514642 -0.9546391 -0.228063 0.0000176 -0.4045298 -0.2239416 0.0000105 0.0000393 0.0000116 -0.0587306 -0.6140182 -0.0319267 0.0000028 0.0368543 -0.3379075 0.0000065 -0.0000009 -0.0000028 -0.2425792 -0.265961 -0.1383862 0.0000044 -0.238037 -0.4968688 0.0000285 0.0000041 0.0000211 0.0748189 -0.1167099 0.0371494 0.0000008 0.217247 -0.563537 0.0000337 -0.0000053 0.0000248 0.0821743 0.5697143 -0.0998606 0.0000026 0.238023 0.2284915 -0.0000107 -0.0000108 -0.0000073 0.0713314 0.4033957 0.1376017 -0.0000053 -0.2273069 0.1991235 -0.0000113 0.0000054 -0.0000003 0.0753288 0.4581074 0.1120721 -0.0000031 0.1464654 1.3372129 -0.0000682 -0.000001 -0.0000346 -0.0751008 0.1620751 0.0805962 -0.0000071 -0.1566874 0.0366753 -0.0000043 0.0000057 -0.0000029 -0.1354014 0.0014405 -0.0412187 0.0000051 0.1159614 0.0416714 -0.0000082 -0.0000019 -0.0000122 -0.1496559 -0.5401349 -0.0245205 0.0000042 -0.0408335 -0.0487308 -0.000006 0.0000061 -0.0000117 -0.1163548 -0.1748762 -0.0238841 0.0000016 -0.0246469 0.101418 -0.0000115 0.0000003 -0.0000131 -0.1605128 -0.3509541 -0.2412182 0.000014 -0.2498419 -0.0293507 -0.0000027 0.0000302 -0.0000018 -0.0995841 1.3399709 0.4359089 -0.0000356 0.6405837 0.3854786 -0.0000246 -0.000061 -0.0000242 -0.0668142 0.0306901 0.1724728 -0.0000051 0.1779132 -0.0163818 -0.000003 -0.0000159 0. -0.1432368 -0.0062161 -0.1167048 0.0000109 -0.161729 0.1409119 -0.0000162 0.0000203 -0.000018 -0.1407674 0.075391 -0.0471406 0.0000038 0.0319996 -0.0168491 0.0000067 0.0000011 0.0000045 0.1619462 0.0834095 0.01843 -0.0000032 -0.0684048 -0.0268675 0.000008 0.0000011 0.0000101 0.1628813 0.0947562 0.009675 -0.0000004 -0.0338382 0.021818 0.0000096 0.0000025 0.0000135 0.1686619 0.0902212 -0.0466732 0.0000014 0.0207833 -0.0390982 0.000009 -0.0000005 0.00001 0.161332 -0.0082301 0.0671902 -0.0000032 0.0486454 0.0592895 0.0000041 -0.0000091 0.0000044 0.1631331 -0.1075226 -0.0617095 -0.0000004 -0.0708667 0.0618793 0.0000029 0.000003 0.0000029 0.1592479 -0.0558241 0.1087943 -0.0000097 0.1091023 0.0111818 0.0000089 -0.0000139 0.0000101 0.1593466 unknown
polarizability: 318.0995505|0.8107559|179.1448698|0.0005364|-0.0058148|59.9483558 unknown
InChI: InChI=1S/C13H7Cl2N/c14-8-5-6-10-12(7-8)16-11-4-2-1-3-9(11)13(10)15/h1-7H
charge 0 multiplicity 1
23 atoms
Cl -0.669402 -3.146345 0.000206
Cl 5.0179 1.252413 -0.000046
N  -0.153998 1.507502 -0.000014
C  0.836603 -0.786783 0.000103
C  -1.628053 -0.512999 0.000071
C  0.933564 0.678123 0.000023
C  -1.399305 0.937983 0.0000
C  -0.470657 -1.331562 0.000144
C  2.048521 -1.561166 0.000119
C  -2.979566 -1.004144 0.000061
C  2.237984 1.288423 -0.00001
C  -2.541557 1.814512 -0.000054
C  3.293892 -0.943805 0.000067
C  3.368076 0.488331 0.000017
C  -4.053691 -0.119801 -0.000002
C  -3.834198 1.301668 -0.000054
H  1.980325 -2.653005 0.00016
H  -3.146413 -2.085641 0.00011
H  2.287554 2.379968 -0.000084
H  -2.340468 2.889839 -0.0001
H  4.214471 -1.534517 0.00009
H  -5.078398 -0.506829 0.000003
H  -4.694286 1.980137 -0.000108
