program: Gaussian 09
title: 000147600
version: EM64L-G09RevD.01
frameworkgroup: C1[X(C11H15NO)]
method: RPBEPBE
basis: SDD
operation: Freq
keyword: #p
keyword: freq=noraman
keyword: PBEPBE/SDD
title: #p freq=noraman PBEPBE/SDD
converged: YES YES NO NO
title: Mulliken charges:
elementType: O N C C C C C C C C C C C H H H H H H H H H H H H H H H
charge: -0.285293 -0.135827 -0.332894 0.255194 0.139943 -0.647523 -0.323424 -0.369861 0.447053 -0.666347 -0.404049 -0.383299 -0.806138 0.255050 0.201838 0.224606 0.232170 0.263605 0.242509 0.262703 0.200108 0.260113 0.216146 0.231409 0.231621 0.226452 0.224852 0.239283
chargesum: 0.00000
title: Mulliken charges with hydrogens summed into heavy atoms:
elementType: O N C C C C C C C C C C C
charge: -0.285293 -0.135827 0.123993 0.255194 0.139943 0.072858 -0.080915 -0.107159 0.447053 0.010019 -0.172640 -0.151678 -0.115550
polarizability: 1.86797325e+02 4.39448202e-01 1.22989132e+02 -3.68263575e+00 -7.82970053e+00 8.14176164e+01
1716.lowfreq: -6.5383 -0.0006 0.0001 0.0007 5.3467 18.5228 36.1264 52.9234 60.4716
frequency: 35.7580 52.9180 60.4451 69.5184 102.1173 152.3300 172.3393 212.4575 217.8016 243.8353 289.9865 326.7024 340.5564 384.0365 410.2991 427.0135 465.5094 545.7926 575.2024 632.0948 666.4025 696.6885 744.9418 777.5009 790.1344 839.0781 856.3551 857.2088 964.7255 979.6926 986.6978 991.0116 1015.3811 1047.0097 1054.6936 1081.2710 1092.5779 1118.4486 1123.9787 1192.4049 1210.6114 1218.0728 1224.1022 1295.8279 1308.9740 1354.6382 1365.7859 1380.7193 1395.1169 1397.0409 1405.1167 1443.2214 1451.4438 1468.4735 1470.2286 1474.0214 1476.1181 1486.6927 1491.7492 1508.5486 1548.4465 1581.9064 1621.0971 2963.0262 2975.3969 2984.4243 2999.3215 3033.5470 3056.8608 3067.4260 3085.3548 3085.9528 3105.9333 3117.4463 3119.8755 3124.4171 3145.6407 3158.7221
redmass: 1.0248 3.8624 3.2471 3.0997 3.6664 2.0686 2.5972 1.4305 1.5031 2.2486 4.4816 3.0980 2.8512 2.6078 2.8553 3.9749 2.9352 3.1298 4.7815 6.8808 4.4266 5.8324 2.8851 1.4411 2.7961 1.7075 1.9555 1.4805 1.3376 1.3956 1.7440 2.0562 2.8445 1.5788 1.7534 1.9100 1.8660 1.3583 1.3226 1.1578 2.9820 2.8014 2.6538 1.6184 1.2845 1.2675 4.9203 1.2472 2.1546 1.2246 3.2177 1.2146 1.2170 1.0492 1.0949 1.0560 1.0531 1.0576 1.1757 2.4172 5.6050 6.3711 6.3190 1.0383 1.0387 1.0363 1.0641 1.0997 1.0948 1.0987 1.0984 1.0999 1.1014 1.0940 1.0897 1.0891 1.0957 1.0957
irintensity: 0.7352 2.1597 0.6967 0.3918 3.2311 0.3187 1.8069 0.4904 0.5642 3.0322 1.4565 4.9884 1.1794 8.8112 0.6655 8.3748 10.8638 9.3370 4.1233 0.9415 1.2694 17.3075 17.2798 2.9557 7.3085 41.0603 2.1711 6.9416 3.2132 1.7945 0.6842 1.0531 13.0900 29.4070 71.7453 41.5884 5.3860 6.6008 13.9461 17.7392 15.9847 16.3824 0.0143 126.6680 1.0769 0.2956 1.0222 38.1851 96.9659 11.7921 10.3944 17.8339 36.5147 7.1545 12.1096 11.5927 12.7330 22.7648 29.4890 5.5847 184.6776 28.2831 29.0891 61.7442 34.1085 31.4991 53.2272 35.1533 22.3448 16.0738 35.3328 17.7116 22.8980 20.1337 8.7387 18.1553 19.4289 4.1971
temp: 298.150 k
press: 1.00000 atm
elementType: 8 7 6 6 6 6 6 6 6 6 6 6 6 1 1 1 1 1 1 1 1 1 1 1 1 1 1 1
symmnumber: 1
zpe: 617238.5 jmol-1
zpe.correction: 0.235094 hartree
zpe.thermalcorrener: 0.248880 hartree
zpe.thermalcorrenthalpy: 0.249824 hartree
zpe.thermalcorrgfe: 0.193729 hartree
zpe.sumelectzpe: -557.178226 hartree
zpe.sumelectthermal: -557.164440 hartree
zpe.sumelectthermalent: -557.163496 hartree
zpe.sumelectthermalfe: -557.219590 hartree
dipole: -0.8233 3.6012 1.5937
dipole: 4.0232
quadrupole: -64.3345 -78.1315 -80.7419
quadrupole: 6.2966 1.2836 -4.8567
quadrupole: 10.0681 -3.7289 -6.3393 6.2966 1.2836 -4.8567
hfenergy: -557.4133195 hartree
pointgroup: C01 [X(C11H15N1O1)]
dipole: 0.3461741 1.1620452 1.0174605 debye
polarizability: 186.8365075|1.8334587|82.7674126|-2.2357231|10.8828142|121.600153 unknown
InChI: InChI=1S/C11H15NO/c1-4-12(3)11(13)10-7-5-9(2)6-8-10/h5-8H,4H2,1-3H3
charge 0 multiplicity 1
28 atoms
O  -1.620808 -1.2533 -1.239606
N  -2.104357 0.273975 0.443908
C  -3.53149 -0.12965 0.375235
C  0.269603 -0.123637 -0.245436
C  -1.207165 -0.396502 -0.386964
C  -1.813167 1.50488 1.198782
C  0.922778 -0.019765 1.009577
C  1.057392 -0.09703 -1.424258
C  3.114868 0.185178 -0.098133
C  -4.314334 0.604435 -0.735299
C  2.324453 0.129196 1.078684
C  2.454607 0.071025 -1.350325
C  4.625074 0.322336 -0.020723
H  -3.55956 -1.215303 0.183687
H  -3.982809 0.065379 1.367036
H  -1.84652 1.332261 2.29271
H  -2.565077 2.278663 0.95165
H  -0.820603 1.897173 0.934261
H  0.341047 -0.083413 1.936175
H  0.557835 -0.223474 -2.39041
H  -4.283248 1.701904 -0.603108
H  -3.888204 0.352962 -1.720568
H  -5.374814 0.292412 -0.724485
H  2.812637 0.196267 2.058644
H  3.044994 0.104172 -2.274091
H  5.03004 0.847775 -0.903426
H  4.937421 0.876227 0.88201
H  5.110806 -0.672245 0.01967
