program: Gaussian 09
title: 000147598
version: EM64L-G09RevD.01
frameworkgroup: C1[X(C7H16N4O2)]
method: RPBEPBE
basis: SDD
operation: Freq
keyword: #p
keyword: freq=noraman
keyword: PBEPBE/SDD
title: #p freq=noraman PBEPBE/SDD
converged: YES YES NO NO
title: Mulliken charges:
elementType: O O N N N N C C C C C C C H H H H H H H H H H H H H H H H
charge: -0.206477 -0.243234 -0.126478 -0.318481 -0.663823 0.138455 -0.357554 -0.342861 -0.391990 -0.356484 -0.464081 -0.694894 0.332719 0.175829 0.220841 0.180138 0.188126 0.189182 0.209391 0.196449 0.193191 0.201258 0.221620 0.210064 0.215334 0.208609 0.367616 0.348834 0.368700
chargesum: 0.00000
title: Mulliken charges with hydrogens summed into heavy atoms:
elementType: O O N N N N C C C C C C C
charge: -0.206477 -0.243234 -0.126478 0.049135 0.053712 0.138455 0.039116 0.025403 0.006583 0.033156 -0.041202 -0.060887 0.332719
polarizability: 1.72505347e+02 -1.39797754e+01 1.20773335e+02 -9.68938550e+00 -7.17279870e+00 8.23598743e+01
1716.lowfreq: -5.9683 0.0002 0.0003 0.0008 5.4719 12.2455 23.0942 30.5698 57.5386
frequency: 22.9136 30.5226 57.3492 65.3758 88.4373 99.1268 126.6788 131.8882 137.1989 195.2934 229.3399 257.2216 288.5752 312.2912 370.9950 396.4871 409.5524 433.3056 498.2094 617.7158 634.8961 636.7984 646.5256 680.5451 702.4638 727.4898 752.8628 817.8434 865.4094 887.1953 894.0670 909.7567 968.7886 1006.1191 1024.9277 1033.0849 1075.6375 1079.4756 1116.0270 1119.0064 1135.0789 1199.3901 1206.4560 1216.4633 1256.8684 1269.6394 1284.4720 1292.9153 1300.0128 1314.4640 1348.2400 1352.8348 1363.2804 1372.1529 1388.6361 1449.5061 1453.2903 1465.0433 1470.1676 1472.5767 1476.8834 1480.9995 1488.7302 1587.2844 1658.2927 2883.3387 2932.2948 2950.2534 2956.7350 2967.6658 2971.2494 2979.4717 2991.9872 3015.8370 3028.8471 3050.3606 3067.8189 3070.2669 3468.0545 3535.5548 3674.5222
redmass: 5.7298 4.8544 1.9366 3.9349 3.2679 6.3278 3.2438 1.8997 3.4377 3.9890 1.1228 2.1401 5.1203 3.1381 3.7429 4.3642 4.3959 1.1774 2.6704 1.4313 4.1692 2.1137 3.2149 1.9617 3.8996 1.0820 1.2328 1.4573 2.4118 1.6450 1.9184 6.7110 1.4319 2.4809 2.8575 2.4219 2.1816 2.1765 2.2202 2.2164 1.8743 1.4991 6.2287 1.3046 1.2724 1.2415 1.0539 1.1609 2.4920 1.3251 1.4846 1.5720 1.6592 2.8964 1.2194 1.0974 1.0823 1.0671 1.0757 2.7186 1.0427 1.0737 1.0897 1.2409 5.8400 1.0566 1.0991 1.0593 1.0634 1.0590 1.0372 1.0630 1.0958 1.0973 1.1016 1.1035 1.1007 1.0993 1.0529 1.0791 1.0970
irintensity: 0.0451 0.8544 0.3934 0.7966 0.5663 1.0231 0.3658 0.0615 3.5201 0.5938 0.0112 0.8460 14.8924 0.1485 0.4407 0.1199 10.9464 117.5230 8.2406 80.4464 7.5196 60.5737 190.9791 0.2852 9.1309 10.3185 1.0094 0.8981 3.9175 3.6487 10.0077 4.4057 1.2876 0.4968 2.0917 1.6168 6.9512 0.8413 16.3492 40.1742 22.5935 3.5035 483.6680 4.4254 2.9695 0.7011 4.9522 1.9605 74.9248 0.7400 37.8831 2.3165 0.3013 66.5792 13.3945 17.5395 8.1957 0.1459 2.0432 330.2724 13.6161 2.1939 21.2765 90.8544 360.4790 53.5134 40.8563 6.8214 16.4663 73.9066 33.0484 81.8233 8.5557 11.4304 9.2990 82.4707 103.0297 53.1951 98.7749 84.0555 63.7901
temp: 298.150 k
press: 1.00000 atm
elementType: 8 8 7 7 7 7 6 6 6 6 6 6 6 1 1 1 1 1 1 1 1 1 1 1 1 1 1 1 1
symmnumber: 1
zpe: 635189.2 jmol-1
zpe.correction: 0.241931 hartree
zpe.thermalcorrener: 0.257306 hartree
zpe.thermalcorrenthalpy: 0.258250 hartree
zpe.thermalcorrgfe: 0.196915 hartree
zpe.sumelectzpe: -644.642956 hartree
zpe.sumelectthermal: -644.627581 hartree
zpe.sumelectthermalent: -644.626637 hartree
zpe.sumelectthermalfe: -644.687972 hartree
dipole: 2.5245 -3.4640 0.5425
dipole: 4.3205
quadrupole: -100.7578 -75.4804 -79.8404
quadrupole: 10.6993 -0.1058 -2.5240
quadrupole: -15.3983 9.8791 5.5191 10.6993 -0.1058 -2.5240
hfenergy: -644.8848866 hartree
pointgroup: C01 [X(C7H16N4O2)]
dipole: 1.0046199 1.3613203 -0.1640714 debye
polarizability: 171.0334562|14.4835602|120.6655352|14.8925464|-6.6101726|83.9395646 unknown
InChI: InChI=1S/C7H16N4O2/c1-2-3-4-5-6-9-7(8)10-11(12)13/h10H,2-6,8H2,1H3
charge 0 multiplicity 1
29 atoms
O  -4.325924 -2.108066 0.054558
O  -4.758191 -0.060048 -0.898316
N  -0.767422 0.685191 0.241822
N  -2.68536 -0.533124 0.035646
N  -2.700864 1.711631 -0.83078
N  -3.990087 -0.913125 -0.288816
C  2.241117 0.535522 -0.178862
C  3.63096 0.194816 0.402702
C  1.491694 1.613178 0.632235
C  4.387682 -0.876095 -0.415717
C  0.074331 1.891767 0.094274
C  5.771849 -1.220599 0.175517
C  -1.996938 0.706893 -0.200202
H  2.35685 0.879808 -1.229007
H  1.6141 -0.376869 -0.212635
H  4.248777 1.116453 0.456268
H  3.513307 -0.160501 1.448011
H  2.070392 2.559602 0.62496
H  1.40583 1.290063 1.688076
H  3.768386 -1.794593 -0.471615
H  4.507698 -0.519244 -1.459219
H  0.147188 2.202395 -0.976015
H  -0.370786 2.748781 0.651465
H  5.67584 -1.609715 1.206926
H  6.292335 -1.987198 -0.427668
H  6.419883 -0.324441 0.215683
H  -2.139646 -1.258173 0.512154
H  -2.237977 2.596552 -1.015188
H  -3.670026 1.547139 -1.116358
