program: Gaussian 09
title: 000147581
version: EM64L-G09RevD.01
frameworkgroup: C1[X(C12H9NO4)]
method: RPBEPBE
basis: SDD
operation: Freq
keyword: #p
keyword: freq=noraman
keyword: PBEPBE/SDD
title: #p freq=noraman PBEPBE/SDD
converged: YES YES NO NO
title: Mulliken charges:
elementType: O O O O N C C C C C C C C C C C C H H H H H H H H H
charge: -0.252655 -0.260075 -0.214612 -0.183011 -0.406396 0.173354 0.376871 0.184387 0.218759 -0.496738 -0.517544 0.060783 0.193549 -0.347423 -0.203394 0.106732 -0.791039 0.308933 0.256591 0.321786 0.258714 0.244763 0.244946 0.232611 0.221808 0.268300
chargesum: 0.00000
title: Mulliken charges with hydrogens summed into heavy atoms:
elementType: O O O O N C C C C C C C C C C C C
charge: -0.252655 -0.260075 -0.214612 -0.183011 -0.084609 0.173354 0.376871 0.184387 0.218759 -0.187805 -0.260953 0.060783 0.193549 -0.088709 0.286314 0.106732 -0.068320
polarizability: 2.61689796e+02 -3.43432785e+00 1.52474650e+02 -3.61357321e-01 -2.03487513e-02 6.80835748e+01
1716.lowfreq: -27.1293 -6.0107 0.0006 0.0010 0.0010 4.2414 8.6263 33.1077 42.7166
frequency: -26.5403 33.0079 42.7061 100.6913 118.0316 141.3113 146.2430 217.7427 244.4171 272.7813 287.1007 328.9485 356.2346 392.0564 403.9506 460.7266 506.2499 514.9720 545.1613 572.1358 591.5086 604.7980 651.1240 657.4951 680.7153 701.6857 729.0991 746.6549 793.5983 795.9998 837.3885 843.4339 890.8561 896.6203 926.5710 942.8184 976.0642 1008.2465 1019.1455 1064.6121 1078.1285 1119.6701 1153.3122 1161.6350 1210.0000 1250.1556 1277.5036 1290.3329 1352.4553 1361.8204 1368.8067 1392.4361 1445.2094 1449.6971 1466.0610 1469.2777 1486.7977 1524.6175 1538.8003 1594.9996 1609.0997 1628.2691 1636.1940 2977.5729 3021.5335 3067.0425 3102.5080 3120.6810 3163.2959 3167.6256 3180.9929 3554.7310
redmass: 2.2971 4.3883 7.5680 8.6316 1.0762 5.3398 6.7083 6.5678 7.2403 6.1366 5.7140 6.8229 7.3676 5.4352 3.1742 7.5295 4.0907 5.3040 4.7992 4.0002 5.0395 1.2525 5.2887 5.6638 9.9878 4.3234 6.8686 6.9015 5.1021 5.3593 1.5870 9.6022 3.6330 1.4927 1.3913 2.4758 5.2187 2.8488 2.0140 1.4531 3.1821 1.0372 1.9129 4.3555 1.3512 3.4355 3.3872 3.0085 1.6999 1.3356 1.6050 3.4641 3.8587 1.1075 1.0685 2.6677 1.3584 3.2739 9.6741 4.2319 8.3275 8.0861 8.0817 1.0382 1.0535 1.0963 1.1191 1.0990 1.0935 1.0923 1.0932 1.0781
irintensity: 14.1343 2.8341 0.2271 4.1393 0.1445 3.6872 0.1683 0.5177 0.9195 2.6735 1.6965 2.7092 2.9643 0.4123 9.0902 12.4363 1.0872 4.4397 24.3733 9.7573 1.8463 91.4737 3.4304 0.8909 0.4786 3.2061 6.1928 6.4535 4.7686 18.3373 48.4821 31.7781 44.7628 11.2817 24.4362 11.1112 170.0364 1.9771 4.8422 4.3682 7.2199 0.0024 79.9781 54.1312 24.8093 95.7608 387.5546 0.1101 17.0698 12.5449 104.3272 16.5507 56.6862 8.7966 21.9430 236.8120 28.2918 235.8754 51.6829 22.8960 235.8040 121.6798 48.8620 6.9684 126.0508 17.8662 26.6980 12.7869 2.0233 4.6948 10.6297 56.0790
temp: 298.150 k
press: 1.00000 atm
elementType: 8 8 8 8 7 6 6 6 6 6 6 6 6 6 6 6 6 1 1 1 1 1 1 1 1 1
symmnumber: 1
zpe: 492049.0 jmol-1
zpe.correction: 0.187412 hartree
zpe.thermalcorrener: 0.200928 hartree
zpe.thermalcorrenthalpy: 0.201873 hartree
zpe.thermalcorrgfe: 0.146232 hartree
zpe.sumelectzpe: -817.106520 hartree
zpe.sumelectthermal: -817.093003 hartree
zpe.sumelectthermalent: -817.092059 hartree
zpe.sumelectthermalfe: -817.147699 hartree
dipole: -4.1598 8.6237 0.4340
dipole: 9.5844
quadrupole: -88.5915 -97.7246 -98.4639
quadrupole: 22.0377 3.2737 -1.1001
quadrupole: 6.3352 -2.7980 -3.5372 22.0377 3.2737 -1.1001
hfenergy: -817.2939312 hartree
pointgroup: C01 [X(C12H9N1O4)]
dipole: 1.6739824 3.3770618 -0.1098593 debye
dipolederiv: -1.6310746 0.1697954 -0.0291456 0.4272923 -0.4318324 0.0015791 -0.0163174 -0.00395 -0.2489819 -1.6486055 0.0986398 -0.0348077 -0.0352318 -0.4229655 -0.008316 -0.0388036 -0.0040754 -0.2528414 -0.4513515 -0.0139156 -0.0222825 -0.2429007 -0.991831 -0.0858481 -0.0291793 -0.0856765 -0.3311888 -0.866069 -0.1846266 0.019721 -0.4298429 -0.6585935 0.1527834 0.0361354 0.1274045 -0.3402733 -1.2016028 -0.2578634 -0.0115508 -0.0881869 -0.491095 -0.0080857 -0.0266024 -0.0041964 -0.2462207 -0.4294878 -0.3366334 -0.041567 -0.1142876 -0.1675541 -0.0152305 -0.0334722 -0.0266415 -0.0451304 0.6617243 -0.1456897 -0.003412 -0.3048643 0.2310766 0.0102848 0.0095068 0.0013895 0.0680279 1.0098449 -0.4014509 0.0006251 -1.0370291 0.0917918 -0.0299324 -0.0226679 -0.0077268 0.0288421 1.3709906 -0.0420569 0.0313291 0.6273763 0.1391149 0.0248284 0.066643 0.0015614 0.0698411 -0.1853149 0.2077649 0.0134432 -0.1265278 0.0373069 0.0005358 -0.0118123 0.0080323 -0.1053239 -0.3989088 0.086876 0.0046754 0.1214235 0.0282566 0.0129774 -0.0011164 0.0156469 -0.2059133 0.876274 0.0115041 0.0197502 0.159827 1.1160376 0.1305242 0.0800103 0.1147894 0.1741749 -1.0414818 0.1353986 0.0093311 -0.4033434 -0.6322376 0.0019011 -0.0454478 -0.0018973 -0.0996345 0.7686313 0.4908286 0.0345956 0.8149123 0.5569632 0.0258688 -0.0288115 0.0229791 -0.0378584 1.3292309 -0.0916508 0.0204077 -0.1004319 0.5561188 -0.0043274 0.0229619 -0.0034445 0.5659446 1.9498044 0.102698 0.059508 0.2975785 0.7666629 -0.2824667 0.1093536 -0.1985291 0.2004076 -0.4031515 0.1998105 -0.0860029 0.313236 -0.2044482 0.0953864 -0.0999176 0.073228 0.0441372 0.1531897 -0.0417242 -0.0009734 0.0495782 0.0697551 -0.0026494 0.0031079 -0.0080958 0.1723963 0.0869069 0.0142289 -0.0031643 -0.0248044 -0.0469674 -0.0122045 -0.003556 -0.0110129 0.1941628 0.1298683 -0.0434481 -0.0040975 0.0160166 0.2155131 -0.0037419 0.005077 -0.005493 0.3167914 0.0443637 0.0811245 0.0063038 0.108817 0.0090961 -0.001662 0.0208808 -0.01012 0.1549323 -0.1023253 0.0229848 -0.0602639 0.0284448 0.0618842 0.013388 -0.1706107 0.0274932 -0.0674131 -0.117299 0.0185696 0.0603696 0.0141232 0.0653617 -0.0004074 0.1648205 -0.0144114 -0.0519037 0.0621605 -0.025261 0.0838526 0.0017233 0.0466035 0.0863954 0.037374 0.0887297 -0.0558706 0.1080161 -0.0169451 -0.0383471 0.0395783 -0.0139069 -0.0955251 -0.0027448 -0.1055008 -0.0159051 -0.0743332 -0.0389578 -0.0282979 -0.1124765 0.0698886 -0.0060557 -0.0248111 0.0095175 0.114801 unknown
polarizability: 261.6892878|2.294663|152.4090165|3.4186291|0.7784566|68.1497166 unknown
InChI: InChI=1S/C12H9NO4/c1-6(14)8-4-13-9-3-11-10(16-5-17-11)2-7(9)12(8)15/h2-4,13H,5H2,1H3
charge 0 multiplicity 1
26 atoms
O  3.703142 -1.434343 -0.027195
O  4.092958 0.933376 0.096884
O  -1.48751 -2.133252 -0.277077
O  -4.207429 -1.399076 0.322674
N  -0.746817 1.940978 0.004649
C  0.097244 -0.335619 -0.071823
C  0.354073 1.06609 -0.000129
C  2.472943 -0.731626 -0.025736
C  2.712471 0.666909 0.046611
C  1.190494 -1.254398 -0.086716
C  1.678967 1.596069 0.060194
C  -1.29721 -0.883359 -0.142168
C  -2.381105 0.136036 -0.0750
C  -2.044567 1.486003 -0.030478
C  4.763701 -0.402317 0.060444
C  -3.82932 -0.249239 -0.033713
C  -4.875474 0.807246 -0.428044
H  0.971102 -2.323401 -0.147853
H  1.875759 2.670463 0.115499
H  -0.56951 2.945417 0.050513
H  -2.809491 2.26656 -0.00163
H  5.328931 -0.538352 0.997917
H  5.398018 -0.453704 -0.840284
H  -4.624425 1.30897 -1.37991
H  -4.979278 1.582446 0.356454
H  -5.846867 0.299022 -0.527683
