program: Gaussian 09
title: 000147569
version: EM64L-G09RevD.01
frameworkgroup: C1[X(C10H12ClN5O4)]
method: RPBEPBE
basis: SDD
operation: Freq
keyword: #p
keyword: freq=noraman
keyword: PBEPBE/SDD
title: #p freq=noraman PBEPBE/SDD
converged: NO YES NO NO
title: Mulliken charges:
elementType: Cl O O O O N N N N N C C C C C C C C C C H H H H H H H H H H H H
charge: 0.046331 -0.246523 -0.432747 -0.491560 -0.448209 -0.138585 0.008120 -0.164916 -0.048254 -0.605260 -0.153286 -0.038575 -0.176700 -0.074985 -0.349096 0.219140 -0.158619 -0.081024 0.161742 -0.318580 0.278390 0.240836 0.245561 0.244081 0.170585 0.215093 0.373143 0.364752 0.411332 0.258393 0.350067 0.339356
chargesum: 0.00000
title: Mulliken charges with hydrogens summed into heavy atoms:
elementType: Cl O O O O N N N N N C C C C C C C C C C
charge: 0.046331 -0.246523 -0.059604 -0.126809 -0.036877 -0.138585 0.008120 -0.164916 -0.048254 0.084163 0.125104 0.202261 0.068861 0.169095 0.036582 0.219140 -0.158619 -0.081024 0.161742 -0.060187
polarizability: 2.17295058e+02 8.82112249e+00 1.90496025e+02 -1.04800638e+01 -4.94013723e+00 8.99770061e+01
1716.lowfreq: -13.9192 -3.4651 -0.0014 -0.0001 0.0006 2.3829 31.1320 48.7155 72.7654
frequency: 31.0941 48.5763 72.7569 102.2043 121.2406 139.1220 143.5847 159.6684 171.4340 205.6859 219.8036 221.3396 245.3986 266.2682 292.2463 307.9267 322.4137 356.7787 374.4040 406.1167 409.8682 515.0479 532.3468 540.1037 541.2448 550.3458 553.6156 565.9964 575.2244 603.8808 644.3169 648.0965 671.8814 707.5962 739.9127 794.4464 798.5329 834.2810 858.1716 867.0852 888.8679 935.4696 950.3211 964.0208 968.8044 984.4986 1024.8214 1034.7469 1046.6220 1055.0534 1063.7085 1066.1494 1147.3447 1178.4044 1204.5328 1208.2439 1231.3182 1245.7053 1254.1733 1254.6967 1278.2923 1288.9700 1300.1537 1320.4444 1327.7440 1341.3742 1355.6738 1371.9538 1374.2742 1382.8286 1404.1129 1422.8753 1460.3363 1464.6003 1502.8857 1540.2856 1585.0488 1638.9307 2902.1865 3000.4825 3012.4428 3023.4512 3033.8412 3051.6232 3074.1859 3171.1672 3479.9471 3536.8747 3611.9376 3690.6816
redmass: 7.6857 5.3333 5.9809 8.5315 7.6824 3.3139 7.4350 7.3855 6.1927 3.2382 1.5038 4.7143 5.2091 5.5208 4.8873 6.3980 6.0973 7.7144 8.2488 5.8767 5.1031 1.7259 1.8392 1.3127 5.2850 7.2868 1.1253 3.6501 4.3942 6.0509 7.1481 7.1660 11.1941 5.0359 5.2372 9.4000 4.1906 6.4585 2.4695 1.3026 8.5357 1.4228 2.8078 2.5852 2.9883 3.7015 4.4064 4.8152 2.3928 4.3550 2.8050 4.3474 1.3064 4.7651 2.5286 1.5129 1.3680 1.4463 1.6337 2.0440 1.4692 3.4047 1.4968 1.6253 4.0177 1.8407 1.5762 1.3227 1.4524 1.4486 2.5772 3.6861 1.0857 3.8563 1.1471 7.7530 1.7962 2.9573 1.0672 1.0765 1.0863 1.0848 1.0834 1.0907 1.0873 1.0928 1.0645 1.0445 1.0670 1.1056
irintensity: 0.2587 4.1782 4.1461 0.1757 1.3630 9.9609 2.0966 4.3676 1.9825 8.8851 129.0340 26.5903 7.4802 9.7571 8.5914 4.4710 3.5630 3.1537 10.9636 0.4527 0.2665 77.2686 50.2450 245.9961 69.4048 4.1429 0.1859 1.0914 13.2142 5.0372 25.9703 16.2096 6.9098 17.5918 15.6223 4.4252 34.8440 60.4494 38.1932 90.2668 14.4506 10.5130 5.1674 9.0106 65.4202 70.5435 17.5691 76.0482 16.2856 112.0493 42.5241 13.5158 28.2130 100.2225 4.7325 55.6821 37.2408 8.8258 23.0779 64.6266 7.9160 62.5851 13.9138 32.6479 43.3923 96.7380 34.1037 25.8995 7.1477 30.3062 12.6984 124.2970 5.8610 35.3813 51.0339 81.2982 39.3847 687.2766 115.0876 952.0945 43.9710 8.4634 177.2938 10.3429 15.7115 7.6276 49.7412 146.3848 22.3597 53.8956
temp: 298.150 k
press: 1.00000 atm
elementType: 17 8 8 8 8 7 7 7 7 7 6 6 6 6 6 6 6 6 6 6 1 1 1 1 1 1 1 1 1 1 1 1
symmnumber: 1
zpe: 614983.2 jmol-1
zpe.correction: 0.234235 hartree
zpe.thermalcorrener: 0.252009 hartree
zpe.thermalcorrenthalpy: 0.252953 hartree
zpe.thermalcorrgfe: 0.188525 hartree
zpe.sumelectzpe: -1421.461821 hartree
zpe.sumelectthermal: -1421.444047 hartree
zpe.sumelectthermalent: -1421.443103 hartree
zpe.sumelectthermalfe: -1421.507531 hartree
dipole: 1.6337 1.1490 1.2613
dipole: 2.3623
quadrupole: -81.6294 -139.9280 -130.4391
quadrupole: -3.5794 -1.6020 -8.8557
quadrupole: 35.7027 -22.5958 -13.1069 -3.5794 -1.6020 -8.8557
hfenergy: -1421.6960559 hartree
pointgroup: C01 [X(C10H12Cl1N5O4)]
dipole: 0.6173835 -0.5154467 -0.4657281 debye
polarizability: 216.8867928|-9.1817503|189.6906443|9.0585422|-13.3221102|91.1906518 unknown
InChI: InChI=1S/C10H12ClN5O4/c11-10-15-4-7(12)13-2-14-8(4)16(10)9-6(19)5(18)3(1-17)20-9/h2-3,5-6,9,17-19H,1,12H2
charge 0 multiplicity 1
32 atoms
Cl -0.315502 -3.567459 0.902456
O  1.690712 0.414878 1.199288
O  2.26217 -2.090562 -1.433749
O  4.17268 -1.037778 0.06564
O  1.36364 3.087657 0.465397
N  -0.188616 -0.829356 0.396794
N  -2.304333 -1.751324 0.343198
N  -0.837028 1.560107 -0.056681
N  -3.256473 1.823539 -0.377838
N  -4.75991 0.006826 -0.234999
C  2.018998 -0.775807 -0.891498
C  1.283371 -0.791963 0.490803
C  3.316181 0.000119 -0.537175
C  2.820308 1.065861 0.453615
C  2.33382 2.344636 -0.294914
C  -1.078803 0.22821 0.124327
C  -1.005161 -1.973179 0.522715
C  -2.368492 -0.369098 0.090924
C  -3.480866 0.480213 -0.174974
C  -1.976246 2.280556 -0.304298
H  1.420503 -0.23027 -1.638733
H  1.58961 -1.692167 1.055945
H  3.803828 0.44185 -1.427703
H  3.560349 1.331318 1.228819
H  1.927944 2.058875 -1.294154
H  3.203555 3.008263 -0.459372
H  3.068824 -2.446408 -0.968944
H  5.032398 -0.655371 0.364697
H  0.509383 2.529193 0.427404
H  -1.837607 3.355137 -0.454145
H  -4.944059 -0.983175 -0.084199
H  -5.519179 0.65828 -0.424447
